program: Orca
programVersion: 5.0.2
elementType: O O O N C C C C C C C C C C C C C C C C C C C C C C H H H H H H H H H H H H H H H H H H H H H H H
charge: 0
multiplicity: 1
keywords: wb97x-d3
keywords: def2-TZVPP
keywords: def2/J RIJCOSX
keywords: DEFGRID2
keywords: scfconv7
keywords: smallprint printgap noloewdin
keywords: NOSOSCF
formula: C22H23NO3
InChI: InChI=1/C22H23NO3/c1-21(2)19(22(21,3)4)20(24)26-18(14-23)15-9-8-12-17(13-15)25-16-10-6-5-7-11-16/h5-13,18-19H,1-4H3
49 atoms
O  0.662996 1.463722 0.623435
O  0.769456 2.668226 -1.253307
O  -2.193629 -2.73436 -0.695108
N  -1.397881 1.415947 3.201739
C  3.619891 1.46728 -1.633512
C  3.883902 2.554033 -0.642799
C  2.735085 1.571833 -0.394461
C  3.083848 1.781664 -3.01175
C  4.525999 0.255498 -1.676318
C  5.053025 2.439764 0.31036
C  3.595982 3.998965 -0.975659
C  1.328767 1.978509 -0.436015
C  -0.728302 1.747388 0.696972
C  -1.542954 0.83669 -0.19055
C  -1.0863 1.556818 2.103445
C  -1.47477 -0.538755 -0.000307
C  -2.333794 1.374455 -1.195455
C  -2.229483 -1.37154 -0.812771
C  -3.069112 0.525992 -2.011486
C  -3.026346 -0.845293 -1.822045
C  -2.100784 -3.308624 0.551183
C  -2.857363 -2.855526 1.625234
C  -1.261642 -4.404652 0.684234
C  -2.754524 -3.506421 2.84582
C  -1.178974 -5.053543 1.908661
C  -1.917223 -4.604507 2.99489
H  2.941357 0.835177 0.373849
H  3.921266 1.85234 -3.708621
H  2.438621 0.974832 -3.363766
H  2.524044 2.707865 -3.087345
H  4.803381 -0.115011 -0.691457
H  4.030772 -0.563302 -2.20136
H  5.444828 0.485299 -2.219453
H  5.213802 1.429379 0.680366
H  5.973706 2.767422 -0.176844
H  4.89484 3.081762 1.178712
H  3.362142 4.555383 -0.066112
H  4.487433 4.452707 -1.413001
H  2.778972 4.154685 -1.673308
H  -0.935247 2.793993 0.453195
H  -0.845075 -0.954665 0.777998
H  -2.378703 2.44609 -1.339091
H  -3.687583 0.936354 -2.798221
H  -3.606879 -1.507917 -2.451055
H  -3.522461 -2.007909 1.517569
H  -0.682751 -4.74858 -0.163511
H  -3.340872 -3.15286 3.683769
H  -0.525841 -5.910035 2.011994
H  -1.843915 -5.107197 3.949844
elementType: O N C H
totalener: -1132.68444394 hartree
nucrepener: 2231.46936123 hartree
electener: -3364.15380517 hartree
oneelecener: -5972.24501104 hartree
twoeener: 2608.09120587 hartree
cpcmener: -0.03250258 hartree
kineticenergy: 1127.65109781 hartree
xcener: -110.658508085028 hartree
chargesum: -0.0000000
charge: -0.298516 -0.481515 -0.340141 -0.105144 0.102739 0.099417 -0.110301 -0.304163 -0.286460 -0.282644 -0.300485 0.394864 0.440445 0.015190 -0.224206 -0.198647 -0.198190 0.236881 -0.121961 -0.230114 0.280471 -0.187596 -0.249323 -0.148109 -0.126439 -0.186524 0.087767 0.098523 0.102342 0.097585 0.093015 0.095467 0.099653 0.092180 0.100624 0.095340 0.102057 0.101130 0.096390 0.140131 0.149397 0.150147 0.162588 0.151010 0.158425 0.149901 0.163432 0.161719 0.161648
qa: -0.2985 -0.4815 -0.3401 -0.1051 0.1027 0.0994 -0.1103 -0.3042 -0.2865 -0.2826 -0.3005 0.3949 0.4404 0.0152 -0.2242 -0.1986 -0.1982 0.2369 -0.1220 -0.2301 0.2805 -0.1876 -0.2493 -0.1481 -0.1264 -0.1865 0.0878 0.0985 0.1023 0.0976 0.0930 0.0955 0.0997 0.0922 0.1006 0.0953 0.1021 0.1011 0.0964 0.1401 0.1494 0.1501 0.1626 0.1510 0.1584 0.1499 0.1634 0.1617 0.1616
va: 2.1231 2.0210 2.0659 3.1082 3.6884 3.7123 3.9135 3.9055 3.9113 3.9064 3.9124 4.0986 3.7076 3.5849 4.0776 3.9522 3.9493 3.7622 3.9038 4.0072 3.6839 3.8988 4.0083 3.8855 3.8792 3.8988 1.0319 0.9985 0.9991 1.0110 1.0053 1.0022 0.9983 1.0055 0.9987 1.0026 0.9992 0.9980 1.0125 1.0177 1.0122 1.0053 0.9882 1.0036 0.9965 1.0064 0.9888 0.9879 0.9893
dispcorr: -0.023792200 hartree
energy: -1132.708236137800
dipole: 29.28960 -28.11036 1.17923 8.92543 -9.04567 -0.12024 -10.05461 9.08088 -0.97373
magnitude: 1.53401 au
magnitude: 3.89915 debye
