program: Gaussian 09
title: 000072257
version: EM64L-G09RevD.01
frameworkgroup: C1[X(C10H12F2N2O4)]
method: RPBEPBE
basis: SDD
operation: Freq
keyword: #p
keyword: freq=noraman
keyword: PBEPBE/SDD
title: #p freq=noraman PBEPBE/SDD
converged: YES YES NO NO
title: Mulliken charges:
elementType: F F O O O O N N C C C C C C C C C C H H H H H H H H H H H H
charge: -0.197396 -0.176323 -0.281326 -0.428505 -0.261916 -0.233856 -0.177149 -0.404441 -0.031270 -0.548221 0.323365 -0.108687 -0.336134 -0.227924 0.223624 0.241673 0.097221 -0.761353 0.284674 0.281116 0.285703 0.259404 0.215518 0.234511 0.289317 0.364424 0.358129 0.249298 0.216753 0.249771
chargesum: 0.00000
title: Mulliken charges with hydrogens summed into heavy atoms:
elementType: F F O O O O N N C C C C C C C C C C
charge: -0.197396 -0.176323 -0.281326 -0.070376 -0.261916 -0.233856 -0.177149 -0.040017 0.253404 0.018597 0.323365 0.150717 0.113896 0.061393 0.223624 0.241673 0.097221 -0.045531
polarizability: 1.76669925e+02 -1.23626146e+01 1.37086362e+02 -5.10451784e+00 7.12221377e-01 9.25444280e+01
1716.lowfreq: -10.0617 -0.0007 -0.0002 0.0006 7.1797 9.9628 31.9138 39.9016 55.1546
frequency: 31.8924 39.8565 54.8268 74.4123 101.8105 112.8221 126.5754 154.7708 158.4104 175.4249 228.8872 249.7653 273.3626 276.7087 299.5874 344.2707 369.0888 380.5724 401.0072 418.8734 456.5085 461.9208 511.1642 530.2027 549.1054 583.4031 615.5348 672.0896 699.0183 707.2904 719.2869 747.4519 761.8644 784.0794 813.9839 843.6888 896.7766 902.8230 909.2812 974.4175 989.7654 1007.3470 1025.1094 1050.5922 1053.1355 1082.5555 1103.4000 1135.1850 1141.9501 1155.2024 1187.2260 1225.0242 1232.5034 1265.0166 1267.5485 1287.9113 1301.9346 1324.4960 1346.3104 1347.3378 1370.8356 1386.2121 1387.2933 1407.2894 1433.8535 1450.3113 1454.0009 1459.0440 1471.8243 1622.1348 1642.8954 1672.4313 2989.7063 2992.4724 3006.6780 3050.8915 3066.7060 3070.9401 3097.5658 3099.4549 3122.5608 3171.7993 3522.4469 3558.1403
redmass: 5.9474 6.5424 7.7476 6.2508 3.3687 1.3658 2.6228 5.4131 4.4057 7.5742 8.0116 6.5416 4.2584 3.7591 4.6247 3.5392 4.6527 8.7254 3.8133 1.2433 4.1688 6.3653 3.8248 5.3577 5.1710 8.3431 5.3640 3.8886 3.0831 5.1547 4.0493 6.9788 4.9341 2.1246 2.9697 3.0264 1.4729 2.4000 4.4172 4.7858 2.5543 2.4114 2.0796 1.8804 2.2124 2.7427 2.4979 3.9586 4.5252 2.2780 1.2710 1.9164 4.4040 1.7346 1.5537 1.5881 1.4754 1.4767 1.6805 1.4787 1.7900 1.9267 1.3356 1.2688 1.9204 1.0436 1.0955 1.0844 1.0813 6.1482 8.8809 6.1290 1.0364 1.0802 1.0676 1.0624 1.0863 1.0974 1.1004 1.1007 1.1041 1.0939 1.0770 1.0661
irintensity: 1.0725 4.6714 1.6172 1.1067 2.4646 1.4787 1.0917 2.9528 0.8230 6.3839 3.7205 5.1917 4.0657 4.6487 4.8586 2.1442 17.2169 19.5055 10.2735 144.5092 12.6009 20.3385 3.7334 5.0348 22.2772 2.0983 2.1576 14.2298 14.9205 6.2601 6.9959 6.1433 9.0739 114.4266 12.8533 36.0635 14.9291 32.0143 140.6012 141.7792 35.4971 61.6663 22.5514 12.3875 11.6995 27.9498 103.6246 12.0002 5.2549 78.6102 39.1863 74.4430 12.0250 98.1627 121.7621 87.0564 31.2737 25.8830 47.5070 27.7803 55.7876 13.9363 30.6129 16.2877 72.3112 14.9878 13.6287 7.7135 4.7529 209.4155 286.9087 516.2082 17.0079 10.9919 43.3810 0.7334 6.2124 11.7270 16.7314 12.1186 2.5470 5.7263 63.2130 12.4769
temp: 298.150 k
press: 1.00000 atm
elementType: 9 9 8 8 8 8 7 7 6 6 6 6 6 6 6 6 6 6 1 1 1 1 1 1 1 1 1 1 1 1
symmnumber: 1
zpe: 582879.6 jmol-1
zpe.correction: 0.222007 hartree
zpe.thermalcorrener: 0.239116 hartree
zpe.thermalcorrenthalpy: 0.240060 hartree
zpe.thermalcorrgfe: 0.176174 hartree
zpe.sumelectzpe: -997.009303 hartree
zpe.sumelectthermal: -996.992194 hartree
zpe.sumelectthermalent: -996.991250 hartree
zpe.sumelectthermalfe: -997.055136 hartree
dipole: 1.4842 0.4311 -1.9363
dipole: 2.4774
quadrupole: -130.3138 -107.4973 -107.2448
quadrupole: -2.5671 -2.4428 3.0269
quadrupole: -15.2951 7.5213 7.7738 -2.5671 -2.4428 3.0269
hfenergy: -997.2313103 hartree
pointgroup: C01 [X(C10H12F2N2O4)]
dipole: 0.5865333 0.1801623 0.757338 debye
polarizability: 178.85362|8.6767518|124.3653419|-1.8713094|-18.5663705|103.0817526 unknown
InChI: InChI=1S/C10H12F2N2O4/c1-5-3-14(9(17)13-8(5)16)7-2-10(11,12)6(4-15)18-7/h3,6-7,13,15H,2,4H2,1H3
charge 0 multiplicity 1
30 atoms
F  1.918418 -1.109767 1.819411
F  3.633099 0.393676 1.672529
O  1.314284 -0.23713 -1.042698
O  3.307181 -2.086913 -2.108584
O  -1.430501 2.37924 -1.573047
O  -4.768861 -0.49705 -0.018497
N  -0.793287 0.541315 -0.230027
N  -3.06033 0.903051 -0.768714
C  0.619667 0.898557 -0.36194
C  1.373971 1.122198 0.986181
C  2.417883 0.003361 1.035456
C  2.64827 -0.425104 -0.423935
C  3.081491 -1.871766 -0.680696
C  -1.172215 -0.603692 0.487504
C  -1.743679 1.350915 -0.913816
C  -2.474669 -1.018448 0.614802
C  -3.533178 -0.235363 -0.047617
C  -2.885222 -2.24689 1.387037
H  0.64453 1.790299 -1.009799
H  1.890295 2.095676 0.978778
H  0.704019 1.088394 1.858415
H  3.38087 0.270605 -0.882379
H  2.321599 -2.565899 -0.2720
H  4.051212 -2.066882 -0.194548
H  -0.347397 -1.160946 0.939216
H  -3.772638 1.467034 -1.244141
H  2.456755 -1.914109 -2.588421
H  -3.614733 -1.985966 2.174711
H  -2.016282 -2.738903 1.855691
H  -3.390452 -2.973294 0.725029
