program: Orca
programVersion: 5.0.2
elementType: O O O N C C C C C C C C C C C C C C C C C C C C C C H H H H H H H H H H H H H H H H H H H H H H H
charge: 0
multiplicity: 1
keywords: wb97x-d3
keywords: def2-TZVPP
keywords: def2/J RIJCOSX
keywords: DEFGRID2
keywords: scfconv7
keywords: smallprint printgap noloewdin
keywords: NOSOSCF
formula: C22H23NO3
InChI: InChI=1/C22H23NO3/c1-21(2)19(22(21,3)4)20(24)26-18(14-23)15-9-8-12-17(13-15)25-16-10-6-5-7-11-16/h5-13,18-19H,1-4H3
49 atoms
O  0.130987 2.694064 0.606585
O  0.641456 2.191332 -1.507152
O  -1.588111 -1.97752 1.183403
N  -2.457985 3.888349 2.254194
C  2.99385 0.67983 0.044648
C  3.601405 1.903158 -0.566682
C  2.312747 2.043915 0.225426
C  2.340777 -0.379559 -0.813061
C  3.59658 0.0722 1.290631
C  4.81581 2.534908 0.081452
C  3.641869 2.088914 -2.066697
C  0.996268 2.304991 -0.360011
C  -1.231953 2.778555 0.230122
C  -1.840875 1.421752 -0.05029
C  -1.902788 3.404335 1.370676
C  -1.434187 0.314724 0.684067
C  -2.798323 1.293644 -1.044591
C  -1.992095 -0.922458 0.407871
C  -3.359873 0.04929 -1.296734
C  -2.962274 -1.065872 -0.577173
C  -1.263035 -3.170533 0.584715
C  -1.577322 -4.32836 1.28255
C  -0.599865 -3.232786 -0.635076
C  -1.223173 -5.560786 0.75275
C  -0.261919 -4.47395 -1.156802
C  -0.571302 -5.640698 -0.470598
H  2.425349 2.462687 1.219503
H  1.563977 -0.895511 -0.244123
H  1.884656 -0.012796 -1.727777
H  3.084278 -1.12664 -1.097401
H  2.853047 -0.531882 1.813868
H  4.426344 -0.586847 1.026473
H  3.969675 0.810624 1.996928
H  4.755443 2.577814 1.167199
H  5.722247 1.986741 -0.182616
H  4.936641 3.559832 -0.274293
H  3.549587 3.145091 -2.325568
H  4.612086 1.751146 -2.436542
H  2.881405 1.545241 -2.617931
H  -1.373728 3.438024 -0.632488
H  -0.6851 0.396319 1.462428
H  -3.10258 2.157119 -1.622205
H  -4.111968 -0.055456 -2.066953
H  -3.404163 -2.032674 -0.782085
H  -2.090825 -4.263323 2.233471
H  -0.341135 -2.331208 -1.17636
H  -1.468654 -6.462373 1.298562
H  0.252963 -4.523576 -2.107337
H  -0.304242 -6.603505 -0.885091
elementType: O N C H
totalener: -1132.68339629 hartree
nucrepener: 2282.70919785 hartree
electener: -3415.39259414 hartree
oneelecener: -6074.28678805 hartree
twoeener: 2658.89419392 hartree
cpcmener: -0.03402907 hartree
kineticenergy: 1127.65179284 hartree
xcener: -110.659432315892 hartree
chargesum: 0.0000000
charge: -0.291964 -0.465196 -0.341762 -0.102738 0.112277 0.116289 -0.106786 -0.306034 -0.282741 -0.290830 -0.302901 0.354480 0.417566 0.018617 -0.223150 -0.242678 -0.198967 0.232920 -0.130532 -0.161181 0.301718 -0.246933 -0.195175 -0.130003 -0.172798 -0.182332 0.090121 0.087592 0.101749 0.108941 0.096357 0.100718 0.092887 0.093231 0.100243 0.096767 0.102552 0.096306 0.095213 0.146886 0.139757 0.150104 0.164066 0.162758 0.147952 0.161398 0.161355 0.161993 0.161887
qa: -0.2920 -0.4652 -0.3418 -0.1027 0.1123 0.1163 -0.1068 -0.3060 -0.2827 -0.2908 -0.3029 0.3545 0.4176 0.0186 -0.2231 -0.2427 -0.1990 0.2329 -0.1305 -0.1612 0.3017 -0.2469 -0.1952 -0.1300 -0.1728 -0.1823 0.0901 0.0876 0.1017 0.1089 0.0964 0.1007 0.0929 0.0932 0.1002 0.0968 0.1026 0.0963 0.0952 0.1469 0.1398 0.1501 0.1641 0.1628 0.1480 0.1614 0.1614 0.1620 0.1619
va: 2.1028 2.0322 2.0495 3.1111 3.7156 3.7217 3.8940 3.9168 3.9016 3.9077 3.8990 4.1413 3.7091 3.6102 4.0835 4.0144 3.9853 3.7757 3.8917 3.9163 3.6444 4.0033 3.8669 3.8872 3.9240 3.8942 1.0319 0.9971 1.0107 1.0008 1.0024 0.9989 1.0051 1.0048 0.9986 1.0017 0.9992 0.9985 1.0110 1.0154 1.0259 1.0008 0.9887 0.9924 1.0078 0.9932 0.9880 0.9904 0.9888
dispcorr: -0.026003549 hartree
energy: -1132.709399836590
dipole: 28.26579 -26.91613 1.34967 -5.22463 3.84596 -1.37867 -7.64094 6.39512 -1.24582
magnitude: 2.29661 au
magnitude: 5.83751 debye
