program: Orca
programVersion: 5.0.2
elementType: Cl O O O N C C C C C C C C C C C C C C C C C C C C C C C C C H H H H H H H H H H H H H H H H H H H H H H
charge: 0
multiplicity: 1
keywords: wb97x-d3
keywords: def2-TZVPP
keywords: def2/J RIJCOSX
keywords: DEFGRID2
keywords: scfconv7
keywords: smallprint printgap noloewdin
keywords: NOSOSCF
formula: C25H22ClNO3
InChI: InChI=1/C25H22ClNO3/c1-17(2)24(18-11-13-20(26)14-12-18)25(28)30-23(16-27)19-7-6-10-22(15-19)29-21-8-4-3-5-9-21/h3-15,17,23-24H,1-2H3
52 atoms
Cl -3.145659 -4.122425 0.87828
O  2.357905 0.93339 0.27357
O  1.908144 -0.14881 -1.6367
O  -2.39973 3.15992 -0.589237
N  4.697833 3.276343 0.11999
C  2.215837 -1.420674 0.385772
C  3.288705 -2.373442 -0.188543
C  0.853484 -2.069419 0.48599
C  4.652093 -1.689678 -0.244634
C  3.367288 -3.647624 0.643989
C  2.135072 -0.168427 -0.459339
C  0.145944 -2.471265 -0.644059
C  0.301075 -2.322681 1.735923
C  2.378868 2.192959 -0.400588
C  -1.077534 -3.108266 -0.528122
C  -0.919102 -2.967239 1.868852
C  1.20403 3.036846 0.029754
C  -1.602023 -3.355049 0.729728
C  -0.048073 2.68835 -0.464714
C  1.341424 4.121238 0.883811
C  -1.161851 3.429247 -0.09664
C  3.674704 2.80291 -0.098093
C  0.221499 4.862584 1.232169
C  -1.030101 4.520834 0.752186
C  -2.834388 1.862896 -0.640098
C  -2.653208 0.991412 0.426416
C  -3.520105 1.459202 -1.774932
C  -3.167111 -0.292132 0.34688
C  -4.033876 0.171897 -1.837867
C  -3.856967 -0.709352 -0.782416
H  2.530798 -1.132942 1.392856
H  2.990659 -2.640514 -1.206962
H  4.666142 -0.826144 -0.910709
H  4.966001 -1.352607 0.745469
H  5.411047 -2.381824 -0.609728
H  3.624935 -3.42471 1.682034
H  4.139508 -4.309684 0.251604
H  2.428657 -4.200072 0.644516
H  0.542067 -2.281585 -1.632142
H  0.833487 -2.018974 2.628926
H  2.335075 2.034396 -1.48235
H  -1.623969 -3.402544 -1.413109
H  -1.333637 -3.160873 2.848605
H  -0.155632 1.851532 -1.145517
H  2.312305 4.401877 1.270188
H  0.326402 5.712377 1.892967
H  -1.906907 5.094205 1.022341
H  -2.122646 1.311294 1.314191
H  -3.65385 2.153055 -2.594376
H  -3.033087 -0.968188 1.179643
H  -4.57216 -0.141675 -2.722599
H  -4.254068 -1.714223 -0.832171
totalener: -1706.63190114 hartree
nucrepener: 3001.67405645 hartree
electener: -4708.30595758 hartree
oneelecener: -8297.37708959 hartree
twoeener: 3589.07113201 hartree
kineticenergy: 1700.60127855 hartree
xcener: -142.766474659246 hartree
chargesum: -0.0000000
charge: -0.078239 -0.250305 -0.368380 -0.300021 -0.000345 0.093502 0.029770 -0.052819 -0.264154 -0.283287 0.325402 -0.127142 -0.124646 0.322968 -0.139304 -0.151524 -0.032254 0.062736 -0.094422 -0.162596 0.146810 -0.268665 -0.090975 -0.183610 0.225696 -0.151670 -0.204496 -0.086747 -0.099786 -0.150315 0.073968 0.058080 0.093754 0.088956 0.086422 0.078563 0.092677 0.101453 0.132513 0.112052 0.133169 0.119330 0.124790 0.141941 0.127242 0.130817 0.131150 0.126558 0.125906 0.129147 0.125811 0.124517
qa: -0.0782 -0.2503 -0.3684 -0.3000 -0.0003 0.0935 0.0298 -0.0528 -0.2642 -0.2833 0.3254 -0.1271 -0.1246 0.3230 -0.1393 -0.1515 -0.0323 0.0627 -0.0944 -0.1626 0.1468 -0.2687 -0.0910 -0.1836 0.2257 -0.1517 -0.2045 -0.0867 -0.0998 -0.1503 0.0740 0.0581 0.0938 0.0890 0.0864 0.0786 0.0927 0.1015 0.1325 0.1121 0.1332 0.1193 0.1248 0.1419 0.1272 0.1308 0.1312 0.1266 0.1259 0.1291 0.1258 0.1245
va: 1.2283 2.1255 2.1228 2.1034 3.1185 3.7765 3.8348 3.6547 3.9391 3.9456 4.2080 3.9921 3.9753 3.8046 3.9973 3.9905 3.8340 3.8767 3.8696 3.9930 3.9061 4.0333 3.9634 4.0353 3.8119 3.9581 4.0397 3.8885 3.9842 3.9333 1.0454 1.0225 1.0135 1.0047 1.0064 1.0048 1.0086 1.0024 1.0264 1.0103 1.0276 1.0154 1.0126 1.0152 1.0212 0.9998 1.0102 1.0082 1.0130 1.0016 0.9990 1.0126
dispcorr: -0.031596896 hartree
energy: -1706.663498032981
dipole: 17.96175 -18.43083 -0.46909 -5.91121 5.28650 -0.62470 0.03871 0.32047 0.35918
magnitude: 0.85983 au
magnitude: 2.18551 debye
