program: Orca
programVersion: 5.0.2
elementType: Cl O O O N C C C C C C C C C C C C C C C C C C C C C C C C C H H H H H H H H H H H H H H H H H H H H H H
charge: 0
multiplicity: 1
keywords: wb97x-d3
keywords: def2-TZVPP
keywords: def2/J RIJCOSX
keywords: DEFGRID2
keywords: scfconv7
keywords: smallprint printgap noloewdin
keywords: NOSOSCF
formula: C25H22ClNO3
InChI: InChI=1/C25H22ClNO3/c1-17(2)24(18-11-13-20(26)14-12-18)25(28)30-23(16-27)19-7-6-10-22(15-19)29-21-8-4-3-5-9-21/h3-15,17,23-24H,1-2H3
52 atoms
Cl -0.727934 -2.836091 3.758329
O  2.538375 0.911132 -0.42929
O  1.4813 0.097405 -2.227496
O  -3.101223 0.681787 -0.218858
N  2.866981 3.950545 0.852824
C  2.83716 -1.377535 -0.871059
C  2.947917 -2.396638 -2.012093
C  1.959298 -1.822166 0.283928
C  3.899329 -1.896947 -3.095578
C  3.417223 -3.745124 -1.477197
C  2.226126 -0.062443 -1.303309
C  2.471213 -1.920582 1.570914
C  0.604197 -2.074181 0.086201
C  1.620333 1.999723 -0.354424
C  1.658129 -2.254929 2.642961
C  -0.221371 -2.405269 1.146137
C  0.390384 1.565459 0.40631
C  0.311607 -2.485612 2.422001
C  -0.806536 1.400627 -0.271934
C  0.490107 1.231958 1.752929
C  -1.916678 0.913947 0.410062
C  2.331874 3.083066 0.324151
C  -0.618766 0.738759 2.415755
C  -1.826461 0.582844 1.752438
C  -3.558588 1.57875 -1.143526
C  -4.11478 1.071331 -2.307577
C  -3.520739 2.948965 -0.91625
C  -4.640227 1.94343 -3.248988
C  -4.040475 3.809259 -1.870499
C  -4.601502 3.313437 -3.038509
H  3.840511 -1.181704 -0.477163
H  1.957184 -2.526744 -2.457295
H  3.986631 -2.631298 -3.89691
H  3.562735 -0.965226 -3.547823
H  4.901888 -1.736184 -2.692072
H  3.502203 -4.46781 -2.2892
H  2.73148 -4.158633 -0.73819
H  4.401054 -3.663883 -1.00877
H  3.521191 -1.723089 1.747691
H  0.171239 -1.989066 -0.902623
H  1.347697 2.351774 -1.354051
H  2.067466 -2.321723 3.641511
H  -1.275942 -2.577703 0.983556
H  -0.871595 1.630579 -1.328196
H  1.428182 1.350052 2.279678
H  -0.547285 0.467628 3.4602
H  -2.695978 0.196715 2.267906
H  -4.136757 0.001396 -2.467272
H  -3.095133 3.342134 -0.001782
H  -5.075878 1.546187 -4.156153
H  -4.011732 4.876156 -1.692923
H  -5.007839 3.990399 -3.777453
totalener: -1706.62921237 hartree
nucrepener: 3032.00955252 hartree
electener: -4738.63876489 hartree
oneelecener: -8358.21910997 hartree
twoeener: 3619.58034508 hartree
kineticenergy: 1700.62195903 hartree
xcener: -142.772699092507 hartree
chargesum: -0.0000000
charge: -0.080167 -0.256736 -0.342660 -0.301228 0.000065 0.066037 0.059396 -0.018354 -0.276497 -0.280004 0.289903 -0.142031 -0.161473 0.321935 -0.131973 -0.153205 0.044868 0.100856 -0.129256 -0.209619 0.222218 -0.270378 -0.062078 -0.229732 0.228881 -0.204799 -0.150002 -0.092078 -0.119168 -0.140520 0.088205 0.044877 0.084777 0.103305 0.080339 0.091426 0.100209 0.077873 0.107784 0.128492 0.119877 0.120019 0.125247 0.126889 0.116786 0.132516 0.129902 0.123879 0.133203 0.125620 0.129471 0.127102
qa: -0.0802 -0.2567 -0.3427 -0.3012 0.0001 0.0660 0.0594 -0.0184 -0.2765 -0.2800 0.2899 -0.1420 -0.1615 0.3219 -0.1320 -0.1532 0.0449 0.1009 -0.1293 -0.2096 0.2222 -0.2704 -0.0621 -0.2297 0.2289 -0.2048 -0.1500 -0.0921 -0.1192 -0.1405 0.0882 0.0449 0.0848 0.1033 0.0803 0.0914 0.1002 0.0779 0.1078 0.1285 0.1199 0.1200 0.1252 0.1269 0.1168 0.1325 0.1299 0.1239 0.1332 0.1256 0.1295 0.1271
va: 1.2285 2.1505 2.1471 2.0984 3.1200 3.7499 3.8233 3.5362 3.9308 3.9453 4.2942 4.0056 3.9598 3.8305 4.0150 3.9848 3.6047 3.8726 3.8939 4.0099 3.8176 4.0393 3.8431 4.0017 3.8185 4.0441 3.9353 3.9391 3.9509 3.9595 1.0355 1.0258 1.0072 1.0143 1.0039 1.0076 1.0039 1.0049 1.0116 1.0183 1.0198 1.0139 1.0108 1.0209 1.0197 1.0014 1.0150 1.0144 1.0049 0.9990 0.9997 1.0001
dispcorr: -0.033341502 hartree
energy: -1706.662553873157
dipole: 10.70577 -10.98399 -0.27822 -6.46610 5.53711 -0.92898 -22.36028 21.79580 -0.56448
magnitude: 1.12208 au
magnitude: 2.85209 debye
