program: Orca
programVersion: 5.0.2
elementType: Cl O O O N C C C C C C C C C C C C C C C C C C C C C C C C C H H H H H H H H H H H H H H H H H H H H H H
charge: 0
multiplicity: 1
keywords: wb97x-d3
keywords: def2-TZVPP
keywords: def2/J RIJCOSX
keywords: DEFGRID2
keywords: scfconv7
keywords: smallprint printgap noloewdin
keywords: NOSOSCF
formula: C25H22ClNO3
InChI: InChI=1/C25H22ClNO3/c1-17(2)24(18-11-13-20(26)14-12-18)25(28)30-23(16-27)19-7-6-10-22(15-19)29-21-8-4-3-5-9-21/h3-15,17,23-24H,1-2H3
52 atoms
Cl -1.68579 -3.15387 2.518281
O  2.985996 0.791184 0.295671
O  2.559142 0.31832 -1.849261
O  -2.276801 1.50899 -1.633256
N  3.003085 3.580118 2.088267
C  3.313816 -1.43898 -0.367263
C  3.768714 -2.30181 -1.55131
C  2.075373 -1.94887 0.345151
C  5.0549 -1.75035 -2.159323
C  3.967132 -3.748185 -1.111526
C  2.941649 -0.028549 -0.769089
C  0.869164 -2.07724 -0.337933
C  2.100386 -2.226384 1.705418
C  2.180182 1.963253 0.210536
C  -0.284968 -2.464393 0.319989
C  0.953904 -2.61927 2.37862
C  0.726518 1.593745 0.38215
C  -0.235659 -2.726501 1.679231
C  -0.152963 1.767822 -0.674653
C  0.29417 1.009673 1.567229
C  -1.473045 1.358398 -0.545194
C  2.650783 2.854009 1.271364
C  -1.021331 0.595256 1.680346
C  -1.910814 0.761914 0.629694
C  -3.56646 1.931675 -1.480123
C  -4.509753 1.402248 -2.349048
C  -3.931759 2.890299 -0.542616
C  -5.823998 1.836688 -2.279118
C  -5.252256 3.30741 -0.477895
C  -6.203958 2.785713 -1.341578
H  4.12862 -1.389593 0.363388
H  2.988904 -2.27706 -2.318019
H  4.934887 -0.736197 -2.53805
H  5.864109 -1.745284 -1.425062
H  5.380482 -2.370156 -2.995393
H  3.049113 -4.194051 -0.73006
H  4.723365 -3.821831 -0.326204
H  4.306677 -4.357797 -1.949313
H  0.813986 -1.849148 -1.394974
H  3.02693 -2.126381 2.257146
H  2.331781 2.473741 -0.745583
H  -1.21999 -2.540704 -0.216903
H  0.985691 -2.829251 3.438862
H  0.178821 2.205371 -1.607745
H  0.979226 0.866942 2.392914
H  -1.360849 0.120281 2.59085
H  -2.935204 0.425816 0.726193
H  -4.207805 0.660969 -3.077306
H  -3.196041 3.314162 0.128674
H  -6.55612 1.423673 -2.960474
H  -5.534351 4.054381 0.252422
H  -7.231276 3.119026 -1.286404
totalener: -1706.62950575 hartree
nucrepener: 2995.65034572 hartree
electener: -4702.27985146 hartree
oneelecener: -8285.45522405 hartree
twoeener: 3583.17537259 hartree
kineticenergy: 1700.61480003 hartree
xcener: -142.770836877247 hartree
chargesum: 0.0000000
charge: -0.079371 -0.257586 -0.340611 -0.298406 0.000614 0.071104 0.058794 -0.020920 -0.276636 -0.279240 0.284377 -0.153268 -0.145331 0.317679 -0.148735 -0.136686 0.046642 0.100809 -0.158695 -0.206450 0.211482 -0.266907 -0.100689 -0.159496 0.250883 -0.217651 -0.159215 -0.089971 -0.119460 -0.144190 0.088038 0.045153 0.102131 0.080538 0.085142 0.099899 0.078388 0.091103 0.129014 0.108706 0.120503 0.121470 0.120901 0.114466 0.121340 0.132656 0.138693 0.124607 0.133915 0.125934 0.128092 0.126441
qa: -0.0794 -0.2576 -0.3406 -0.2984 0.0006 0.0711 0.0588 -0.0209 -0.2766 -0.2792 0.2844 -0.1533 -0.1453 0.3177 -0.1487 -0.1367 0.0466 0.1008 -0.1587 -0.2064 0.2115 -0.2669 -0.1007 -0.1595 0.2509 -0.2177 -0.1592 -0.0900 -0.1195 -0.1442 0.0880 0.0452 0.1021 0.0805 0.0851 0.0999 0.0784 0.0911 0.1290 0.1087 0.1205 0.1215 0.1209 0.1145 0.1213 0.1327 0.1387 0.1246 0.1339 0.1259 0.1281 0.1264
va: 1.2285 2.1499 2.1523 2.1046 3.1206 3.7492 3.8224 3.5388 3.9323 3.9445 4.3058 3.9585 3.9971 3.8326 3.9874 4.0178 3.6038 3.8711 4.0468 4.0136 3.8904 4.0385 3.8928 3.9249 3.7975 4.0404 3.9283 3.9387 3.9526 3.9623 1.0354 1.0264 1.0145 1.0039 1.0072 1.0040 1.0049 1.0075 1.0181 1.0116 1.0182 1.0132 1.0135 1.0297 1.0191 1.0039 1.0032 1.0145 1.0048 0.9988 0.9999 1.0002
dispcorr: -0.032545647 hartree
energy: -1706.662051395519
dipole: 12.86557 -13.33032 -0.46474 -6.62688 5.57752 -1.04936 -14.60001 14.15640 -0.44361
magnitude: 1.23042 au
magnitude: 3.12749 debye
