program: Orca
programVersion: 5.0.2
elementType: Cl O O O N C C C C C C C C C C C C C C C C C C C C C C C C C H H H H H H H H H H H H H H H H H H H H H H
charge: 0
multiplicity: 1
keywords: wb97x-d3
keywords: def2-TZVPP
keywords: def2/J RIJCOSX
keywords: DEFGRID2
keywords: scfconv7
keywords: smallprint printgap noloewdin
keywords: NOSOSCF
formula: C25H22ClNO3
InChI: InChI=1/C25H22ClNO3/c1-17(2)24(18-11-13-20(26)14-12-18)25(28)30-23(16-27)19-7-6-10-22(15-19)29-21-8-4-3-5-9-21/h3-15,17,23-24H,1-2H3
52 atoms
Cl 5.290673 -4.642011 2.606882
O  1.267941 0.199792 0.314443
O  1.67052 0.141289 -1.878457
O  -3.235411 2.636861 0.257554
N  1.883931 2.211601 2.843662
C  1.082989 -1.905624 -0.73511
C  -0.365564 -2.167889 -0.266821
C  2.137616 -2.565715 0.127522
C  -1.366201 -1.475331 -1.185863
C  -0.63756 -3.666516 -0.223695
C  1.375212 -0.427963 -0.862837
C  2.135115 -2.462269 1.517123
C  3.141324 -3.313957 -0.476312
C  1.504635 1.602306 0.330982
C  3.101447 -3.095226 2.281876
C  4.118063 -3.953159 0.273622
C  0.344313 2.38654 -0.23129
C  4.087754 -3.838232 1.65242
C  -0.939251 2.1550 0.251013
C  0.561889 3.313345 -1.238814
C  -2.002625 2.867162 -0.279359
C  1.718353 1.92853 1.743028
C  -0.511834 4.028068 -1.751542
C  -1.795117 3.814043 -1.27784
C  -4.334132 2.591597 -0.559337
C  -5.496244 3.188606 -0.093977
C  -4.314817 1.930439 -1.781419
C  -6.650653 3.122734 -0.86144
C  -5.473636 1.882682 -2.542467
C  -6.643695 2.477449 -2.089952
H  1.178117 -2.307537 -1.747667
H  -0.492307 -1.767423 0.743292
H  -2.387082 -1.694235 -0.869386
H  -1.263123 -0.388086 -1.184985
H  -1.259398 -1.818735 -2.217438
H  -0.509329 -4.120486 -1.209385
H  -1.663163 -3.857346 0.096145
H  0.020386 -4.189265 0.47099
H  1.368739 -1.896221 2.029178
H  3.163517 -3.41086 -1.554882
H  2.425518 1.852586 -0.2057
H  3.079707 -3.009083 3.359861
H  4.885605 -4.535301 -0.217336
H  -1.121783 1.429135 1.035457
H  1.561181 3.480193 -1.620019
H  -0.34865 4.760381 -2.530999
H  -2.622519 4.383653 -1.681647
H  -5.496542 3.696966 0.8619
H  -3.411755 1.452143 -2.139741
H  -7.557342 3.587781 -0.497105
H  -5.45912 1.369487 -3.495152
H  -7.543697 2.434692 -2.688928
elementType: Cl O N C H
totalener: -1706.65686870 hartree
nucrepener: 2865.24682607 hartree
electener: -4571.90369476 hartree
oneelecener: -8024.66572795 hartree
twoeener: 3452.76203319 hartree
cpcmener: -0.03295203 hartree
kineticenergy: 1700.54616332 hartree
xcener: -142.758359884101 hartree
chargesum: 0.0000000
charge: -0.098270 -0.265729 -0.412604 -0.326651 -0.084322 0.191356 0.029103 -0.034405 -0.298719 -0.300414 0.314697 -0.220212 -0.179197 0.391365 -0.149985 -0.154287 0.064919 0.102164 -0.310001 -0.192658 0.252639 -0.231534 -0.124533 -0.171002 0.262765 -0.234568 -0.176442 -0.127740 -0.156037 -0.175944 0.091239 0.059545 0.096125 0.085784 0.099524 0.091504 0.098135 0.099371 0.139327 0.139845 0.142433 0.142793 0.142513 0.141356 0.145968 0.160940 0.159117 0.146080 0.160557 0.157342 0.158863 0.157884
qa: -0.0983 -0.2657 -0.4126 -0.3267 -0.0843 0.1914 0.0291 -0.0344 -0.2987 -0.3004 0.3147 -0.2202 -0.1792 0.3914 -0.1500 -0.1543 0.0649 0.1022 -0.3100 -0.1927 0.2526 -0.2315 -0.1245 -0.1710 0.2628 -0.2346 -0.1764 -0.1277 -0.1560 -0.1759 0.0912 0.0595 0.0961 0.0858 0.0995 0.0915 0.0981 0.0994 0.1393 0.1398 0.1424 0.1428 0.1425 0.1414 0.1460 0.1609 0.1591 0.1461 0.1606 0.1573 0.1589 0.1579
va: 1.2063 2.1239 2.0957 2.0733 3.1083 3.6100 3.8346 3.5647 3.9509 3.9350 4.2500 3.9977 4.0065 3.7587 4.0129 3.9914 3.5495 3.8288 4.0175 3.9784 3.7826 4.0754 3.8987 3.9189 3.7069 3.9998 3.8824 3.8906 3.9074 3.8979 1.0337 1.0204 1.0044 1.0009 1.0048 1.0019 1.0047 1.0015 1.0146 1.0045 1.0135 1.0065 1.0065 1.0232 1.0040 0.9902 0.9941 1.0075 0.9942 0.9894 0.9910 0.9901
dispcorr: -0.028967110 hartree
energy: -1706.685835808915
dipole: -29.22398 27.66254 -1.56145 1.53393 -1.62975 -0.09583 -17.66166 15.62324 -2.03842
magnitude: 2.56952 au
magnitude: 6.53120 debye
