program: Orca
programVersion: 5.0.2
elementType: Cl O O O N C C C C C C C C C C C C C C C C C C C C C C C C C H H H H H H H H H H H H H H H H H H H H H H
charge: 0
multiplicity: 1
keywords: wb97x-d3
keywords: def2-TZVPP
keywords: def2/J RIJCOSX
keywords: DEFGRID2
keywords: scfconv7
keywords: smallprint printgap noloewdin
keywords: NOSOSCF
formula: C25H22ClNO3
InChI: InChI=1/C25H22ClNO3/c1-17(2)24(18-11-13-20(26)14-12-18)25(28)30-23(16-27)19-7-6-10-22(15-19)29-21-8-4-3-5-9-21/h3-15,17,23-24H,1-2H3
52 atoms
Cl 5.238747 -4.751216 2.626829
O  1.278002 0.224544 0.326686
O  1.808104 0.157157 -1.839475
O  -3.244396 2.593388 0.21008
N  1.826253 2.228524 2.875972
C  1.130802 -1.880763 -0.729827
C  -0.325296 -2.125915 -0.275726
C  2.16443 -2.57043 0.135958
C  -1.306922 -1.423982 -1.208366
C  -0.616352 -3.620684 -0.23082
C  1.447323 -0.406389 -0.841807
C  2.195354 -2.422385 1.521496
C  3.105582 -3.403777 -0.459043
C  1.500953 1.629298 0.353658
C  3.137712 -3.087281 2.289593
C  4.055486 -4.078039 0.29463
C  0.341229 2.396228 -0.233058
C  4.063155 -3.911973 1.668633
C  -0.945919 2.148384 0.230166
C  0.560657 3.319587 -1.243308
C  -2.012803 2.841224 -0.319182
C  1.67866 1.952634 1.771138
C  -0.516629 4.014062 -1.776286
C  -1.804031 3.785145 -1.320246
C  -4.353273 2.571721 -0.592734
C  -5.51681 3.119624 -0.072401
C  -4.34754 1.976716 -1.848591
C  -6.686148 3.071405 -0.817744
C  -5.521745 1.947712 -2.587348
C  -6.693151 2.493019 -2.079432
H  1.228798 -2.274763 -1.745248
H  -0.456501 -1.722349 0.732621
H  -1.179821 -0.339469 -1.224633
H  -1.203255 -1.785137 -2.23417
H  -2.333863 -1.614837 -0.89353
H  0.01998 -4.147383 0.480707
H  -0.473018 -4.081732 -1.211112
H  -1.650808 -3.796677 0.068019
H  1.475156 -1.794192 2.028766
H  3.099486 -3.53999 -1.533633
H  2.430392 1.892624 -0.161304
H  3.144467 -2.962458 3.36408
H  4.773755 -4.725623 -0.189885
H  -1.129431 1.424657 1.01635
H  1.562844 3.499986 -1.610425
H  -0.352987 4.743728 -2.558123
H  -2.632473 4.341403 -1.740059
H  -5.506044 3.574271 0.910324
H  -3.444242 1.534874 -2.250895
H  -7.593621 3.496705 -0.409025
H  -5.517837 1.486975 -3.566774
H  -7.604897 2.463571 -2.661259
elementType: Cl O N C H
totalener: -1706.65699008 hartree
nucrepener: 2861.77783022 hartree
electener: -4568.43482030 hartree
oneelecener: -8017.68247063 hartree
twoeener: 3449.24765033 hartree
cpcmener: -0.03266631 hartree
kineticenergy: 1700.53435089 hartree
xcener: -142.756332755475 hartree
chargesum: -0.0000000
charge: -0.098070 -0.267918 -0.413981 -0.325286 -0.084022 0.192851 0.033108 -0.049295 -0.299770 -0.303583 0.319001 -0.205715 -0.178541 0.391815 -0.155149 -0.155025 0.068650 0.103688 -0.320330 -0.196155 0.271778 -0.232108 -0.120470 -0.183266 0.280709 -0.243492 -0.188855 -0.123513 -0.150589 -0.180123 0.090715 0.058048 0.087322 0.099630 0.096766 0.099119 0.091533 0.098675 0.139966 0.139407 0.142467 0.142755 0.142811 0.141215 0.146262 0.160942 0.158032 0.146080 0.157974 0.156895 0.159011 0.158033
qa: -0.0981 -0.2679 -0.4140 -0.3253 -0.0840 0.1929 0.0331 -0.0493 -0.2998 -0.3036 0.3190 -0.2057 -0.1785 0.3918 -0.1551 -0.1550 0.0686 0.1037 -0.3203 -0.1962 0.2718 -0.2321 -0.1205 -0.1833 0.2807 -0.2435 -0.1889 -0.1235 -0.1506 -0.1801 0.0907 0.0580 0.0873 0.0996 0.0968 0.0991 0.0915 0.0987 0.1400 0.1394 0.1425 0.1428 0.1428 0.1412 0.1463 0.1609 0.1580 0.1461 0.1580 0.1569 0.1590 0.1580
va: 1.2065 2.1213 2.0946 2.0772 3.1083 3.6134 3.8313 3.5774 3.9482 3.9370 4.2447 3.9934 4.0049 3.7604 4.0187 3.9948 3.5459 3.8272 4.0230 3.9824 3.7683 4.0745 3.8958 3.9264 3.6903 4.0051 3.8933 3.8888 3.9015 3.9022 1.0339 1.0207 1.0020 1.0048 1.0046 1.0011 1.0021 1.0047 1.0151 1.0045 1.0138 1.0067 1.0063 1.0236 1.0041 0.9901 0.9946 1.0078 0.9958 0.9895 0.9908 0.9902
dispcorr: -0.028958528 hartree
energy: -1706.685948608766
dipole: -29.01181 27.41662 -1.59519 2.09296 -2.14130 -0.04834 -17.80656 15.75843 -2.04813
magnitude: 2.59650 au
magnitude: 6.59978 debye
