program: Orca
programVersion: 5.0.2
elementType: Cl O O O N C C C C C C C C C C C C C C C C C C C C C C C C C H H H H H H H H H H H H H H H H H H H H H H
charge: 0
multiplicity: 1
keywords: wb97x-d3
keywords: def2-TZVPP
keywords: def2/J RIJCOSX
keywords: DEFGRID2
keywords: scfconv7
keywords: smallprint printgap noloewdin
keywords: NOSOSCF
formula: C25H22ClNO3
InChI: InChI=1/C25H22ClNO3/c1-17(2)24(18-11-13-20(26)14-12-18)25(28)30-23(16-27)19-7-6-10-22(15-19)29-21-8-4-3-5-9-21/h3-15,17,23-24H,1-2H3
52 atoms
Cl -1.15893 -2.040628 4.150171
O  2.631888 0.774018 -0.520006
O  1.248007 -0.074011 -2.058606
O  -2.915034 2.034913 -0.092733
N  3.686899 3.784836 0.316443
C  2.495662 -1.568306 -0.619711
C  2.449761 -2.711895 -1.640056
C  1.583411 -1.752023 0.579561
C  3.444035 -2.460008 -2.768477
C  2.757212 -4.038065 -0.954933
C  2.06331 -0.238876 -1.19207
C  2.090162 -1.670848 1.870907
C  0.213067 -1.937972 0.410614
C  1.967248 2.036702 -0.579898
C  1.257049 -1.771672 2.975965
C  -0.633699 -2.037192 1.502486
C  0.722709 1.984935 0.272934
C  -0.102112 -1.947421 2.779977
C  -0.521088 2.084262 -0.330215
C  0.83037 1.734855 1.638004
C  -1.664973 1.913962 0.441092
C  2.938916 3.006124 -0.074281
C  -0.318677 1.58269 2.394682
C  -1.570407 1.65823 1.799904
C  -3.214147 1.442886 -1.289257
C  -2.681105 0.217834 -1.67276
C  -4.133275 2.098965 -2.096697
C  -3.07658 -0.343067 -2.879064
C  -4.52531 1.520649 -3.294807
C  -3.996826 0.300701 -3.694848
H  3.521986 -1.472591 -0.252151
H  1.443819 -2.768318 -2.066653
H  4.465289 -2.400719 -2.384293
H  3.41451 -3.27349 -3.494957
H  3.240101 -1.536931 -3.313004
H  3.73355 -4.013395 -0.46456
H  2.777289 -4.848733 -1.684827
H  2.013313 -4.298606 -0.20134
H  3.151856 -1.521658 2.024838
H  -0.213514 -2.006433 -0.582688
H  1.726775 2.318648 -1.609503
H  1.667787 -1.702678 3.974341
H  -1.696215 -2.176423 1.353978
H  -0.594734 2.284752 -1.392232
H  1.801062 1.655142 2.111832
H  -0.243899 1.386018 3.455818
H  -2.469443 1.524062 2.388113
H  -1.971209 -0.303718 -1.042581
H  -4.541293 3.05221 -1.784152
H  -2.661625 -1.297501 -3.176642
H  -5.244257 2.033666 -3.920523
H  -4.300669 -0.145506 -4.632532
elementType: Cl O N C H
totalener: -1706.65601222 hartree
nucrepener: 3064.35233257 hartree
electener: -4771.00834480 hartree
oneelecener: -8422.94940137 hartree
twoeener: 3651.94105658 hartree
cpcmener: -0.03181915 hartree
kineticenergy: 1700.54451435 hartree
xcener: -142.760927873342 hartree
chargesum: -0.0000000
charge: -0.097686 -0.272454 -0.416693 -0.329221 -0.085335 0.131146 0.063796 0.009301 -0.294850 -0.308590 0.314391 -0.180965 -0.224176 0.396079 -0.149105 -0.170043 0.076082 0.122870 -0.202223 -0.274549 0.293607 -0.229276 -0.097485 -0.240345 0.260733 -0.140434 -0.226991 -0.184847 -0.135684 -0.166813 0.097271 0.045632 0.089573 0.093766 0.095776 0.090292 0.097145 0.098040 0.137347 0.151741 0.136682 0.139895 0.140028 0.145474 0.145167 0.154234 0.145243 0.140116 0.144887 0.156006 0.157911 0.157535
qa: -0.0977 -0.2725 -0.4167 -0.3292 -0.0853 0.1311 0.0638 0.0093 -0.2949 -0.3086 0.3144 -0.1810 -0.2242 0.3961 -0.1491 -0.1700 0.0761 0.1229 -0.2022 -0.2745 0.2936 -0.2293 -0.0975 -0.2403 0.2607 -0.1404 -0.2270 -0.1848 -0.1357 -0.1668 0.0973 0.0456 0.0896 0.0938 0.0958 0.0903 0.0971 0.0980 0.1373 0.1517 0.1367 0.1399 0.1400 0.1455 0.1452 0.1542 0.1452 0.1401 0.1449 0.1560 0.1579 0.1575
va: 1.2065 2.1522 2.0767 2.0845 3.1118 3.6648 3.8104 3.4409 3.9289 3.9481 4.2881 3.9751 3.9546 3.7583 3.9683 3.9714 3.5201 3.7727 3.9620 3.9660 3.7089 4.0789 3.8416 3.9939 3.7160 3.8588 3.9806 3.9388 3.9011 3.8902 1.0384 1.0271 1.0019 1.0044 1.0123 1.0021 1.0049 1.0008 1.0048 1.0023 1.0172 1.0072 1.0092 1.0103 1.0106 0.9934 1.0074 0.9929 1.0086 0.9928 0.9891 0.9903
dispcorr: -0.034127049 hartree
energy: -1706.690139271128
dipole: 9.33582 -9.47082 -0.13500 -15.22971 13.58558 -1.64413 -21.95543 21.33646 -0.61897
magnitude: 1.76196 au
magnitude: 4.47854 debye
