program: Orca
programVersion: 5.0.2
elementType: Cl O O O N C C C C C C C C C C C C C C C C C C C C C C C C C H H H H H H H H H H H H H H H H H H H H H H
charge: 0
multiplicity: 1
keywords: wb97x-d3
keywords: def2-TZVPP
keywords: def2/J RIJCOSX
keywords: DEFGRID2
keywords: scfconv7
keywords: smallprint printgap noloewdin
keywords: NOSOSCF
formula: C25H22ClNO3
InChI: InChI=1/C25H22ClNO3/c1-17(2)24(18-11-13-20(26)14-12-18)25(28)30-23(16-27)19-7-6-10-22(15-19)29-21-8-4-3-5-9-21/h3-15,17,23-24H,1-2H3
52 atoms
Cl 3.799433 -5.293445 -3.410147
O  0.68012 0.38667 0.08601
O  2.645491 -0.113642 1.005321
O  -3.591972 3.115043 -0.662027
N  1.428265 2.883974 2.272205
C  1.017433 -1.872311 0.699381
C  1.135264 -2.427687 2.134559
C  1.734613 -2.714798 -0.332771
C  0.385592 -1.539136 3.122265
C  0.595877 -3.850948 2.192612
C  1.557975 -0.463849 0.631528
C  3.10299 -2.96381 -0.250231
C  1.02025 -3.277277 -1.384317
C  1.090475 1.74051 -0.05775
C  3.741686 -3.753625 -1.192431
C  1.64368 -4.072446 -2.335233
C  0.012996 2.48504 -0.803479
C  3.004714 -4.303013 -2.230432
C  -1.300033 2.426594 -0.349334
C  0.347206 3.237988 -1.918362
C  -2.278408 3.146149 -1.01896
C  1.290485 2.353387 1.262748
C  -0.646357 3.942956 -2.584803
C  -1.955106 3.906632 -2.138023
C  -3.959033 2.959291 0.649159
C  -3.344413 3.665167 1.676439
C  -5.023637 2.109382 0.909931
C  -3.80026 3.500641 2.976167
C  -5.478534 1.966631 2.213379
C  -4.865524 2.653392 3.251739
H  -0.043279 -1.845482 0.436032
H  2.19339 -2.444498 2.413184
H  0.773577 -0.519174 3.158172
H  -0.676753 -1.48274 2.873692
H  0.465743 -1.941917 4.132961
H  1.148916 -4.532982 1.546199
H  -0.455086 -3.888105 1.895496
H  0.66399 -4.240353 3.209455
H  3.691536 -2.547009 0.556718
H  -0.044975 -3.099036 -1.467266
H  2.037756 1.806166 -0.601508
H  4.804859 -3.937471 -1.113526
H  1.069169 -4.503519 -3.144111
H  -1.551857 1.827546 0.517927
H  1.372342 3.278043 -2.26378
H  -0.396078 4.533607 -3.456013
H  -2.729441 4.462171 -2.652061
H  -2.521307 4.338766 1.472987
H  -5.494828 1.569763 0.097827
H  -3.31986 4.047586 3.777178
H  -6.311984 1.306337 2.415164
H  -5.217574 2.533741 4.267878
elementType: Cl O N C H
totalener: -1706.65879837 hartree
nucrepener: 2835.80513297 hartree
electener: -4542.46393134 hartree
oneelecener: -7966.03353083 hartree
twoeener: 3423.56959948 hartree
cpcmener: -0.03292492 hartree
kineticenergy: 1700.53782705 hartree
xcener: -142.756055317350 hartree
chargesum: -0.0000000
charge: -0.098318 -0.278946 -0.425114 -0.325101 -0.092483 0.150457 0.053352 -0.046535 -0.285958 -0.311584 0.349366 -0.190394 -0.163247 0.428507 -0.168652 -0.165594 0.001159 0.111671 -0.205338 -0.192168 0.247426 -0.229418 -0.118965 -0.226506 0.291383 -0.202434 -0.249317 -0.136121 -0.119040 -0.186848 0.084872 0.055944 0.090667 0.091182 0.094748 0.098939 0.089840 0.099151 0.142722 0.141295 0.131909 0.142582 0.142061 0.148180 0.146653 0.158578 0.147776 0.155694 0.145758 0.159755 0.157994 0.158461
qa: -0.0983 -0.2789 -0.4251 -0.3251 -0.0925 0.1505 0.0534 -0.0465 -0.2860 -0.3116 0.3494 -0.1904 -0.1632 0.4285 -0.1687 -0.1656 0.0012 0.1117 -0.2053 -0.1922 0.2474 -0.2294 -0.1190 -0.2265 0.2914 -0.2024 -0.2493 -0.1361 -0.1190 -0.1868 0.0849 0.0559 0.0907 0.0912 0.0947 0.0989 0.0898 0.0992 0.1427 0.1413 0.1319 0.1426 0.1421 0.1482 0.1467 0.1586 0.1478 0.1557 0.1458 0.1598 0.1580 0.1585
va: 1.2060 2.1746 2.0704 2.0881 3.1025 3.6878 3.8220 3.5736 3.9364 3.9444 4.1979 4.0023 3.9834 3.7361 4.0357 4.0067 3.7401 3.8202 3.9462 3.9469 3.7816 4.0052 3.9120 4.0010 3.6817 3.9193 4.0142 3.8864 3.8810 3.9101 1.0419 1.0235 1.0109 1.0032 1.0046 1.0004 1.0020 1.0048 1.0222 1.0034 1.0194 1.0071 1.0070 1.0147 1.0028 0.9900 1.0054 0.9976 1.0080 0.9899 0.9891 0.9904
dispcorr: -0.026699258 hartree
energy: -1706.685497625669
dipole: -15.35699 13.96941 -1.38758 1.85154 -2.22179 -0.37026 21.66397 -22.47811 -0.81414
magnitude: 1.65085 au
magnitude: 4.19612 debye
