program: Orca
programVersion: 5.0.2
elementType: Cl O O O N C C C C C C C C C C C C C C C C C C C C C C C C C H H H H H H H H H H H H H H H H H H H H H H
charge: 0
multiplicity: 1
keywords: wb97x-d3
keywords: def2-TZVPP
keywords: def2/J RIJCOSX
keywords: DEFGRID2
keywords: scfconv7
keywords: smallprint printgap noloewdin
keywords: NOSOSCF
formula: C25H22ClNO3
InChI: InChI=1/C25H22ClNO3/c1-17(2)24(18-11-13-20(26)14-12-18)25(28)30-23(16-27)19-7-6-10-22(15-19)29-21-8-4-3-5-9-21/h3-15,17,23-24H,1-2H3
52 atoms
Cl -2.512435 -1.598785 2.784302
O  2.71117 0.697233 -0.379281
O  2.005754 -0.343427 -2.237314
O  -2.607412 1.128359 0.524895
N  3.872138 3.803336 -0.591733
C  2.66263 -1.643343 -0.305287
C  2.997876 -2.871488 -1.157474
C  1.374312 -1.725034 0.495931
C  4.331508 -2.672462 -1.870926
C  3.048439 -4.123383 -0.289989
C  2.449308 -0.390508 -1.122857
C  0.189689 -2.162642 -0.090676
C  1.332937 -1.247946 1.801721
C  2.064917 1.923981 -0.720973
C  -1.005071 -2.141547 0.611358
C  0.143824 -1.208839 2.514397
C  0.913323 2.122833 0.233134
C  -1.018926 -1.654907 1.908699
C  -0.31776 1.580467 -0.122938
C  1.093363 2.715355 1.475256
C  -1.379251 1.65516 0.769091
C  3.078287 2.975018 -0.637668
C  0.02547 2.774065 2.359402
C  -1.208319 2.251201 2.014035
C  -3.06671 0.913592 -0.74619
C  -3.729695 -0.282941 -0.978173
C  -2.956807 1.869513 -1.748794
C  -4.276057 -0.530162 -2.22927
C  -3.496675 1.603154 -2.998823
C  -4.15492 0.405925 -3.246599
H  3.486462 -1.468233 0.393276
H  2.220749 -3.007272 -1.915338
H  4.328949 -1.808187 -2.536509
H  5.143892 -2.536539 -1.15303
H  4.57494 -3.544545 -2.47964
H  3.798493 -4.027881 0.498962
H  3.31427 -4.993628 -0.891946
H  2.091451 -4.338959 0.186255
H  0.182195 -2.525936 -1.110857
H  2.239756 -0.89414 2.276491
H  1.708931 1.906848 -1.755266
H  -1.913747 -2.494514 0.143315
H  0.129348 -0.828849 3.527037
H  -0.433527 1.105361 -1.089256
H  2.050743 3.132385 1.761684
H  0.154456 3.236854 3.328863
H  -2.041295 2.300971 2.704133
H  -3.82615 -1.007897 -0.179842
H  -2.461461 2.814568 -1.564286
H  -4.79423 -1.463793 -2.406625
H  -3.407829 2.345781 -3.781308
H  -4.575303 0.207502 -4.223693
elementType: Cl O N C H
totalener: -1706.65423663 hartree
nucrepener: 3103.64546059 hartree
electener: -4810.29969722 hartree
oneelecener: -8501.76674149 hartree
twoeener: 3691.46704427 hartree
cpcmener: -0.03067242 hartree
kineticenergy: 1700.54150205 hartree
xcener: -142.762563787343 hartree
chargesum: -0.0000000
charge: -0.097432 -0.273483 -0.413837 -0.311013 -0.086047 0.130259 0.058227 0.051712 -0.296783 -0.303504 0.324809 -0.214319 -0.239974 0.380569 -0.178222 -0.152982 -0.018005 0.136112 -0.205431 -0.203942 0.345271 -0.223482 -0.099840 -0.272944 0.329576 -0.268280 -0.222510 -0.116334 -0.133540 -0.189742 0.100167 0.044557 0.096469 0.089332 0.093406 0.090251 0.096521 0.099428 0.144251 0.136607 0.137216 0.147760 0.140051 0.145501 0.137229 0.158215 0.139853 0.137824 0.155687 0.158124 0.158835 0.157825
qa: -0.0974 -0.2735 -0.4138 -0.3110 -0.0860 0.1303 0.0582 0.0517 -0.2968 -0.3035 0.3248 -0.2143 -0.2400 0.3806 -0.1782 -0.1530 -0.0180 0.1361 -0.2054 -0.2039 0.3453 -0.2235 -0.0998 -0.2729 0.3296 -0.2683 -0.2225 -0.1163 -0.1335 -0.1897 0.1002 0.0446 0.0965 0.0893 0.0934 0.0903 0.0965 0.0994 0.1443 0.1366 0.1372 0.1478 0.1401 0.1455 0.1372 0.1582 0.1399 0.1378 0.1557 0.1581 0.1588 0.1578
va: 1.2118 2.1275 2.0845 2.0753 3.1106 3.6486 3.8156 3.4551 3.9313 3.9428 4.2653 3.9761 4.0191 3.7552 3.9613 3.9359 3.7235 3.7481 3.8541 3.9714 3.5523 4.0744 3.8901 4.0235 3.6367 3.9855 3.9320 3.9077 3.8824 3.9225 1.0335 1.0281 1.0115 1.0027 1.0040 1.0024 1.0047 1.0017 1.0101 1.0098 1.0259 0.9979 1.0087 1.0150 1.0110 0.9892 1.0131 1.0197 0.9985 0.9902 0.9899 0.9906
dispcorr: -0.034806484 hartree
energy: -1706.689043117015
dipole: 14.65024 -15.20568 -0.55544 -14.77472 13.53841 -1.23631 -13.29170 13.39439 0.10269
magnitude: 1.35923 au
magnitude: 3.45489 debye
