program: Orca
programVersion: 5.0.2
elementType: Cl O O O N C C C C C C C C C C C C C C C C C C C C C C C C C H H H H H H H H H H H H H H H H H H H H H H
charge: 0
multiplicity: 1
keywords: wb97x-d3
keywords: def2-TZVPP
keywords: def2/J RIJCOSX
keywords: DEFGRID2
keywords: scfconv7
keywords: smallprint printgap noloewdin
keywords: NOSOSCF
formula: C25H22ClNO3
InChI: InChI=1/C25H22ClNO3/c1-17(2)24(18-11-13-20(26)14-12-18)25(28)30-23(16-27)19-7-6-10-22(15-19)29-21-8-4-3-5-9-21/h3-15,17,23-24H,1-2H3
52 atoms
Cl -2.606004 -3.159029 0.079411
O  2.842917 0.708832 0.838189
O  3.413541 0.375652 -1.294976
O  -2.198772 0.693671 0.267182
N  2.269464 3.282357 2.819868
C  3.196249 -1.521118 0.198642
C  4.113097 -2.386093 -0.678665
C  1.735523 -1.930729 0.162589
C  5.570241 -1.967292 -0.507744
C  3.949287 -3.860149 -0.325907
C  3.203854 -0.063875 -0.196956
C  1.006815 -1.882493 -1.023616
C  1.089617 -2.337788 1.324108
C  2.452368 2.042386 0.528318
C  -0.330398 -2.245711 -1.055473
C  -0.246974 -2.708915 1.309547
C  1.122389 2.066881 -0.186793
C  -0.945296 -2.662099 0.114855
C  0.035246 1.404811 0.374275
C  0.998139 2.723577 -1.400999
C  -1.175808 1.397258 -0.297688
C  2.359563 2.72317 1.820868
C  -0.223042 2.708877 -2.061233
C  -1.310975 2.042699 -1.522915
C  -3.46871 1.205756 0.242049
C  -3.724545 2.551005 0.479702
C  -4.509551 0.314975 0.023611
C  -5.036939 3.00005 0.483276
C  -5.817741 0.776781 0.041711
C  -6.08815 2.11977 0.264024
H  3.539826 -1.59647 1.235199
H  3.827614 -2.249948 -1.726356
H  5.747223 -0.926671 -0.781645
H  5.894526 -2.098608 0.527354
H  6.22109 -2.578512 -1.134794
H  2.939185 -4.224261 -0.515917
H  4.177528 -4.043931 0.726896
H  4.630885 -4.470406 -0.920484
H  1.476252 -1.559629 -1.944895
H  1.63482 -2.375479 2.259145
H  3.216189 2.55702 -0.062929
H  -0.881665 -2.203773 -1.985205
H  -0.731185 -3.031764 2.22137
H  0.1188 0.893441 1.326698
H  1.847557 3.236147 -1.833702
H  -0.325471 3.209402 -3.014919
H  -2.252587 2.024061 -2.057082
H  -2.915438 3.246379 0.66537
H  -4.295344 -0.730948 -0.155221
H  -5.235799 4.048181 0.666262
H  -6.628029 0.079487 -0.128003
H  -7.109288 2.477367 0.269419
elementType: Cl O N C H
totalener: -1706.65743517 hartree
nucrepener: 3022.33517971 hartree
electener: -4728.99261487 hartree
oneelecener: -8339.78736236 hartree
twoeener: 3610.79474748 hartree
cpcmener: -0.03179921 hartree
kineticenergy: 1700.54177435 hartree
xcener: -142.759007129535 hartree
chargesum: -0.0000000
charge: -0.104008 -0.276469 -0.414094 -0.323237 -0.085513 0.137725 0.063901 -0.031759 -0.291983 -0.311809 0.313059 -0.162176 -0.182700 0.415590 -0.195249 -0.149092 0.068864 0.136010 -0.286358 -0.185481 0.230100 -0.236293 -0.117628 -0.181588 0.269951 -0.170628 -0.240055 -0.156053 -0.144630 -0.173183 0.096942 0.045675 0.094914 0.088810 0.092892 0.097913 0.089796 0.098311 0.142055 0.138213 0.141835 0.141563 0.142522 0.138734 0.145236 0.160271 0.160025 0.154745 0.141940 0.158022 0.157226 0.157144
qa: -0.1040 -0.2765 -0.4141 -0.3232 -0.0855 0.1377 0.0639 -0.0318 -0.2920 -0.3118 0.3131 -0.1622 -0.1827 0.4156 -0.1952 -0.1491 0.0689 0.1360 -0.2864 -0.1855 0.2301 -0.2363 -0.1176 -0.1816 0.2700 -0.1706 -0.2401 -0.1561 -0.1446 -0.1732 0.0969 0.0457 0.0949 0.0888 0.0929 0.0979 0.0898 0.0983 0.1421 0.1382 0.1418 0.1416 0.1425 0.1387 0.1452 0.1603 0.1600 0.1547 0.1419 0.1580 0.1572 0.1571
va: 1.1984 2.1498 2.0849 2.0375 3.1118 3.6791 3.8082 3.4673 3.9280 3.9509 4.2740 3.9077 3.9853 3.7287 4.0105 4.0196 3.5379 3.7482 4.0439 3.9674 3.7184 4.0903 3.9035 3.9527 3.7058 3.9032 3.9748 3.9022 3.9369 3.8955 1.0379 1.0271 1.0134 1.0019 1.0048 1.0005 1.0020 1.0047 1.0155 1.0044 1.0132 1.0076 1.0064 1.0223 1.0042 0.9899 0.9945 0.9976 1.0262 0.9906 0.9906 0.9903
dispcorr: -0.032081083 hartree
energy: -1706.689516250246
dipole: 17.78741 -17.53913 0.24828 -5.12954 4.66364 -0.46590 -6.53200 5.29559 -1.23641
magnitude: 1.34441 au
magnitude: 3.41721 debye
