program: Orca
programVersion: 5.0.2
elementType: Cl O O O N C C C C C C C C C C C C C C C C C C C C C C C C C H H H H H H H H H H H H H H H H H H H H H H
charge: 0
multiplicity: 1
keywords: wb97x-d3
keywords: def2-TZVPP
keywords: def2/J RIJCOSX
keywords: DEFGRID2
keywords: scfconv7
keywords: smallprint printgap noloewdin
keywords: NOSOSCF
formula: C25H22ClNO3
InChI: InChI=1/C25H22ClNO3/c1-17(2)24(18-11-13-20(26)14-12-18)25(28)30-23(16-27)19-7-6-10-22(15-19)29-21-8-4-3-5-9-21/h3-15,17,23-24H,1-2H3
52 atoms
Cl -2.570594 -2.467087 -1.561419
O  2.774307 0.633575 0.802913
O  3.96193 0.002891 -0.991125
O  -2.244203 2.405624 0.969698
N  2.938024 3.62503 2.218231
C  3.042223 -1.672972 0.492403
C  4.07306 -2.720355 0.052835
C  1.635698 -1.919791 -0.023248
C  5.435271 -2.429538 0.67349
C  3.605254 -4.115237 0.450198
C  3.359234 -0.277595 0.008674
C  1.386749 -2.034079 -1.388975
C  0.561874 -1.97787 0.85676
C  2.532036 1.93676 0.268523
C  0.09819 -2.207033 -1.867898
C  -0.73438 -2.154965 0.395071
C  1.122034 1.972506 -0.26571
C  -0.954354 -2.262457 -0.967941
C  0.044484 2.174904 0.586184
C  0.906995 1.674448 -1.60614
C  -1.249448 2.107015 0.08937
C  2.754758 2.874972 1.368389
C  -0.391924 1.589129 -2.084532
C  -1.476638 1.808068 -1.249407
C  -3.484441 1.835117 0.870787
C  -3.659005 0.48467 0.597823
C  -4.574942 2.653208 1.129541
C  -4.942131 -0.041814 0.578218
C  -5.851656 2.109836 1.121627
C  -6.04219 0.76361 0.84186
H  3.004028 -1.660309 1.586107
H  4.171868 -2.686243 -1.036221
H  6.168617 -3.170045 0.350813
H  5.826322 -1.449758 0.396679
H  5.384711 -2.471881 1.764117
H  3.451381 -4.187976 1.529742
H  4.352075 -4.860933 0.173792
H  2.671321 -4.395337 -0.038102
H  2.200034 -1.982499 -2.102362
H  0.73167 -1.886054 1.922382
H  3.249733 2.18267 -0.51943
H  -0.078565 -2.290117 -2.931867
H  -1.557423 -2.20657 1.095372
H  0.192595 2.3992 1.636499
H  1.743588 1.507453 -2.272122
H  -0.566034 1.357717 -3.127084
H  -2.481519 1.755628 -1.648012
H  -2.806455 -0.154403 0.40845
H  -4.42235 3.70338 1.345424
H  -5.077832 -1.093811 0.362309
H  -6.700662 2.747449 1.33187
H  -7.039817 0.344916 0.830989
elementType: Cl O N C H
totalener: -1706.65532297 hartree
nucrepener: 3026.79296880 hartree
electener: -4733.44829177 hartree
oneelecener: -8347.84320113 hartree
twoeener: 3614.39490936 hartree
cpcmener: -0.03035493 hartree
kineticenergy: 1700.53688962 hartree
xcener: -142.758852844143 hartree
chargesum: -0.0000000
charge: -0.094698 -0.273968 -0.413748 -0.321640 -0.085878 0.133798 0.061615 0.003781 -0.293122 -0.307653 0.326853 -0.199090 -0.202531 0.399610 -0.175358 -0.148057 0.027204 0.118322 -0.246478 -0.198735 0.291250 -0.228888 -0.143225 -0.189825 0.230494 -0.105225 -0.215849 -0.163700 -0.144177 -0.158536 0.098143 0.045180 0.093119 0.095178 0.088592 0.089708 0.097176 0.098193 0.142678 0.139247 0.136590 0.143242 0.147492 0.126611 0.148717 0.160054 0.153669 0.106835 0.145282 0.146804 0.157662 0.157283
qa: -0.0947 -0.2740 -0.4137 -0.3216 -0.0859 0.1338 0.0616 0.0038 -0.2931 -0.3077 0.3269 -0.1991 -0.2025 0.3996 -0.1754 -0.1481 0.0272 0.1183 -0.2465 -0.1987 0.2913 -0.2289 -0.1432 -0.1898 0.2305 -0.1052 -0.2158 -0.1637 -0.1442 -0.1585 0.0981 0.0452 0.0931 0.0952 0.0886 0.0897 0.0972 0.0982 0.1427 0.1392 0.1366 0.1432 0.1475 0.1266 0.1487 0.1601 0.1537 0.1068 0.1453 0.1468 0.1577 0.1573
va: 1.2145 2.1303 2.0829 2.0938 3.1093 3.6474 3.8154 3.4446 3.9290 3.9466 4.2663 3.9508 3.9872 3.7372 3.9936 3.9079 3.6652 3.7665 4.0797 3.8792 3.7592 4.0756 3.8592 3.8799 3.7858 3.8694 3.9691 3.9136 3.9057 3.9061 1.0368 1.0270 1.0045 1.0128 1.0022 1.0023 1.0047 1.0011 1.0151 1.0056 1.0228 1.0066 1.0014 1.0290 1.0097 0.9912 0.9971 1.0050 1.0080 1.0043 0.9894 0.9907
dispcorr: -0.033061720 hartree
energy: -1706.688384692335
dipole: 15.14874 -15.74937 -0.60063 -13.76493 12.08522 -1.67971 3.09358 -4.03441 -0.94083
magnitude: 2.01676 au
magnitude: 5.12621 debye
