program: Orca
programVersion: 5.0.2
elementType: Cl O O O N C C C C C C C C C C C C C C C C C C C C C C C C C H H H H H H H H H H H H H H H H H H H H H H
charge: 0
multiplicity: 1
keywords: wb97x-d3
keywords: def2-TZVPP
keywords: def2/J RIJCOSX
keywords: DEFGRID2
keywords: scfconv7
keywords: smallprint printgap noloewdin
keywords: NOSOSCF
formula: C25H22ClNO3
InChI: InChI=1/C25H22ClNO3/c1-17(2)24(18-11-13-20(26)14-12-18)25(28)30-23(16-27)19-7-6-10-22(15-19)29-21-8-4-3-5-9-21/h3-15,17,23-24H,1-2H3
52 atoms
Cl -2.905407 -3.384736 -0.208125
O  2.238334 0.643923 1.029325
O  3.568926 0.482901 -0.753643
O  -2.197127 1.735144 -1.374935
N  1.327819 3.011233 3.132814
C  2.800477 -1.532191 0.374744
C  3.781091 -2.38538 -0.458163
C  1.352775 -1.949075 0.239822
C  3.903617 -3.776418 0.154939
C  3.437124 -2.496978 -1.938436
C  2.936278 -0.049835 0.116178
C  0.570063 -1.534274 -0.835803
C  0.780315 -2.792689 1.185929
C  2.170435 2.052802 0.852781
C  -0.742968 -1.957209 -0.973669
C  -0.52869 -3.233579 1.059949
C  1.21766 2.438356 -0.253373
C  -1.278644 -2.815401 -0.026482
C  -0.061399 1.893829 -0.261571
C  1.624153 3.318029 -1.244331
C  -0.94267 2.254586 -1.270217
C  1.70026 2.574606 2.138172
C  0.732122 3.665334 -2.249636
C  -0.549909 3.143276 -2.265179
C  -2.912963 1.3844 -0.260452
C  -2.947209 2.177088 0.880953
C  -3.666673 0.222755 -0.339711
C  -3.733143 1.78266 1.953904
C  -4.460695 -0.150288 0.735498
C  -4.49111 0.62081 1.888585
H  3.078414 -1.666177 1.426768
H  4.759441 -1.902359 -0.371315
H  4.197575 -3.732738 1.205492
H  2.965376 -4.331474 0.092768
H  4.660534 -4.359273 -0.372295
H  4.233919 -3.031457 -2.458695
H  3.327999 -1.529608 -2.4272
H  2.516763 -3.061071 -2.098663
H  0.975967 -0.872229 -1.591432
H  1.361909 -3.117686 2.039965
H  3.161509 2.479568 0.667528
H  -1.332115 -1.623854 -1.817379
H  -0.95277 -3.895169 1.803388
H  -0.363549 1.197848 0.511809
H  2.625203 3.729768 -1.232918
H  1.037184 4.351746 -3.028332
H  -1.247151 3.416347 -3.047254
H  -2.372663 3.093077 0.940952
H  -3.636037 -0.379863 -1.238457
H  -3.755751 2.396498 2.845078
H  -5.048534 -1.056341 0.671344
H  -5.103557 0.321221 2.728816
elementType: Cl O N C H
totalener: -1706.65526820 hartree
nucrepener: 3061.38122643 hartree
electener: -4768.03649463 hartree
oneelecener: -8417.54066894 hartree
twoeener: 3649.50417431 hartree
cpcmener: -0.03153254 hartree
kineticenergy: 1700.54184641 hartree
xcener: -142.762041405833 hartree
chargesum: 0.0000000
charge: -0.099591 -0.277591 -0.411377 -0.328045 -0.086332 0.123946 0.083149 0.093247 -0.326888 -0.316976 0.336678 -0.299682 -0.243865 0.406286 -0.152517 -0.116484 0.060796 0.094027 -0.283411 -0.206200 0.304137 -0.233424 -0.103111 -0.251220 0.322411 -0.205707 -0.281266 -0.138669 -0.104328 -0.187609 0.101484 0.048833 0.097482 0.088921 0.101150 0.105071 0.097803 0.085315 0.150133 0.146635 0.144210 0.150271 0.143896 0.150059 0.145244 0.158646 0.146761 0.153410 0.146714 0.159032 0.150850 0.157694
qa: -0.0996 -0.2776 -0.4114 -0.3280 -0.0863 0.1239 0.0831 0.0932 -0.3269 -0.3170 0.3367 -0.2997 -0.2439 0.4063 -0.1525 -0.1165 0.0608 0.0940 -0.2834 -0.2062 0.3041 -0.2334 -0.1031 -0.2512 0.3224 -0.2057 -0.2813 -0.1387 -0.1043 -0.1876 0.1015 0.0488 0.0975 0.0889 0.1012 0.1051 0.0978 0.0853 0.1501 0.1466 0.1442 0.1503 0.1439 0.1501 0.1452 0.1586 0.1468 0.1534 0.1467 0.1590 0.1509 0.1577
va: 1.2063 2.1350 2.0875 2.0791 3.1109 3.7347 3.8277 3.4229 3.9432 3.9350 4.2591 3.9522 4.0154 3.7455 3.9323 3.9809 3.5575 3.8318 3.9518 3.9806 3.6963 4.0869 3.8907 4.0318 3.6634 3.9201 3.9700 3.8895 3.8537 3.9379 1.0313 1.0227 1.0020 0.9998 1.0052 1.0047 1.0162 0.9974 0.9994 0.9991 1.0150 1.0017 1.0043 1.0053 1.0036 0.9890 1.0061 0.9988 1.0122 0.9898 0.9999 0.9905
dispcorr: -0.033115919 hartree
energy: -1706.688384117479
dipole: 18.26211 -17.32971 0.93240 -7.60597 6.96758 -0.63839 -4.38669 3.81759 -0.56910
magnitude: 1.26522 au
magnitude: 3.21593 debye
