program: Orca
programVersion: 5.0.2
elementType: Cl O O O N C C C C C C C C C C C C C C C C C C C C C C C C C H H H H H H H H H H H H H H H H H H H H H H
charge: 0
multiplicity: 1
keywords: wb97x-d3
keywords: def2-TZVPP
keywords: def2/J RIJCOSX
keywords: DEFGRID2
keywords: scfconv7
keywords: smallprint printgap noloewdin
keywords: NOSOSCF
formula: C25H22ClNO3
InChI: InChI=1/C25H22ClNO3/c1-17(2)24(18-11-13-20(26)14-12-18)25(28)30-23(16-27)19-7-6-10-22(15-19)29-21-8-4-3-5-9-21/h3-15,17,23-24H,1-2H3
52 atoms
Cl -3.177953 -3.213198 1.331242
O  2.182808 0.386063 -0.907045
O  3.021878 0.713719 1.128341
O  -2.35987 2.013888 0.779173
N  4.541657 2.81838 -1.044195
C  2.543955 -1.544865 0.412237
C  3.256159 -2.275977 -0.743753
C  1.096012 -1.94495 0.609847
C  4.691419 -1.780877 -0.889505
C  3.237962 -3.779059 -0.496286
C  2.625105 -0.042446 0.28456
C  0.170628 -1.947289 -0.432221
C  0.665782 -2.326218 1.875993
C  2.140434 1.785899 -1.126845
C  -1.146818 -2.323634 -0.217901
C  -0.646447 -2.710414 2.107492
C  1.121272 2.49463 -0.260069
C  -1.543429 -2.708951 1.053575
C  -0.132248 1.905306 -0.136876
C  1.384257 3.714709 0.345203
C  -1.124271 2.554393 0.583779
C  3.487408 2.362888 -1.038669
C  0.382665 4.347328 1.068873
C  -0.873446 3.778937 1.189271
C  -2.985166 1.292282 -0.200826
C  -3.79088 0.243616 0.218922
C  -2.888525 1.614905 -1.54953
C  -4.506694 -0.486399 -0.718585
C  -3.595641 0.863555 -2.476782
C  -4.407432 -0.186589 -2.069776
H  3.081976 -1.784299 1.333504
H  2.723227 -2.076688 -1.677857
H  4.753293 -0.721833 -1.148221
H  5.256169 -1.931398 0.033205
H  5.204528 -2.327946 -1.681853
H  3.752728 -4.032949 0.433483
H  3.745577 -4.303865 -1.307186
H  2.224655 -4.177317 -0.435281
H  0.464151 -1.663521 -1.434539
H  1.365783 -2.3327 2.702447
H  1.838895 1.881779 -2.173713
H  -1.84989 -2.321868 -1.040272
H  -0.957611 -3.011887 3.09856
H  -0.337791 0.948634 -0.601233
H  2.35631 4.183414 0.262208
H  0.584622 5.298957 1.542377
H  -1.654854 4.27558 1.750517
H  -3.861073 0.005814 1.272532
H  -2.276689 2.442971 -1.883848
H  -5.137113 -1.300678 -0.387712
H  -3.515262 1.112599 -3.526964
H  -4.960474 -0.763398 -2.799228
elementType: Cl O N C H
totalener: -1706.65513206 hartree
nucrepener: 3055.41360732 hartree
electener: -4762.06873939 hartree
oneelecener: -8405.30260959 hartree
twoeener: 3643.23387020 hartree
cpcmener: -0.03399310 hartree
kineticenergy: 1700.54481553 hartree
xcener: -142.764638191914 hartree
chargesum: -0.0000000
charge: -0.096638 -0.279793 -0.405509 -0.325483 -0.077502 0.187065 0.040929 -0.014063 -0.288579 -0.302817 0.317063 -0.231022 -0.185621 0.474831 -0.177999 -0.145282 -0.015518 0.123961 -0.270511 -0.211900 0.303743 -0.252447 -0.095698 -0.250942 0.306331 -0.248730 -0.195012 -0.135978 -0.145893 -0.177178 0.095034 0.055398 0.088378 0.094825 0.093700 0.090335 0.097865 0.099098 0.141763 0.139421 0.142886 0.146670 0.141726 0.149946 0.133396 0.159417 0.146051 0.141030 0.153866 0.149451 0.159115 0.156825
qa: -0.0966 -0.2798 -0.4055 -0.3255 -0.0775 0.1871 0.0409 -0.0141 -0.2886 -0.3028 0.3171 -0.2310 -0.1856 0.4748 -0.1780 -0.1453 -0.0155 0.1240 -0.2705 -0.2119 0.3037 -0.2524 -0.0957 -0.2509 0.3063 -0.2487 -0.1950 -0.1360 -0.1459 -0.1772 0.0950 0.0554 0.0884 0.0948 0.0937 0.0903 0.0979 0.0991 0.1418 0.1394 0.1429 0.1467 0.1417 0.1499 0.1334 0.1594 0.1461 0.1410 0.1539 0.1495 0.1591 0.1568
va: 1.2116 2.1132 2.1012 2.0919 3.0998 3.6109 3.8289 3.5377 3.9460 3.9325 4.2173 3.9369 4.0316 3.8273 3.9588 3.9972 3.7567 3.8022 3.9704 3.9526 3.7181 4.1000 3.9037 4.0247 3.6763 3.9245 3.8897 3.8475 3.8945 3.9016 1.0318 1.0216 1.0100 1.0035 1.0043 1.0026 1.0048 1.0011 1.0178 1.0040 0.9899 1.0051 1.0066 1.0107 1.0176 0.9893 1.0064 1.0158 0.9975 1.0008 0.9899 0.9909
dispcorr: -0.033012161 hartree
energy: -1706.688144224662
dipole: 16.37454 -17.46104 -1.08650 -7.33274 6.28004 -1.05270 -9.41150 8.08316 -1.32834
magnitude: 2.01324 au
magnitude: 5.11725 debye
