program: Orca
programVersion: 5.0.2
elementType: Cl O O O N C C C C C C C C C C C C C C C C C C C C C C C C C H H H H H H H H H H H H H H H H H H H H H H
charge: 0
multiplicity: 1
keywords: wb97x-d3
keywords: def2-TZVPP
keywords: def2/J RIJCOSX
keywords: DEFGRID2
keywords: scfconv7
keywords: smallprint printgap noloewdin
keywords: NOSOSCF
formula: C25H22ClNO3
InChI: InChI=1/C25H22ClNO3/c1-17(2)24(18-11-13-20(26)14-12-18)25(28)30-23(16-27)19-7-6-10-22(15-19)29-21-8-4-3-5-9-21/h3-15,17,23-24H,1-2H3
52 atoms
Cl -3.065666 -2.571175 -0.358169
O  2.751259 0.727358 0.488364
O  3.551586 -0.19833 -1.391762
O  -1.983058 1.315593 -1.156106
N  4.419804 3.542721 1.063643
C  2.833559 -1.614379 0.435593
C  3.725469 -2.768142 -0.045195
C  1.348619 -1.853435 0.23385
C  5.193716 -2.476545 0.248526
C  3.310297 -4.071717 0.625666
C  3.124525 -0.3135 -0.275807
C  0.831765 -2.104919 -1.035116
C  0.470822 -1.797624 1.30997
C  2.653889 2.017809 -0.108202
C  -0.52467 -2.313378 -1.22402
C  -0.89028 -2.007962 1.138665
C  1.227772 2.498112 0.026827
C  -1.377274 -2.271221 -0.131241
C  0.246961 1.722459 -0.584642
C  0.872636 3.63829 0.730258
C  -1.082518 2.092354 -0.490205
C  3.632819 2.878752 0.555617
C  -0.466164 4.005432 0.804295
C  -1.450018 3.244538 0.198649
C  -3.185342 0.994047 -0.587849
C  -3.342548 0.801276 0.778439
C  -4.249039 0.800921 -1.458222
C  -4.582059 0.413998 1.266573
C  -5.478803 0.403498 -0.955917
C  -5.653726 0.212338 0.408178
H  3.008169 -1.465325 1.505879
H  3.600933 -2.883011 -1.126314
H  5.556632 -1.577826 -0.251221
H  5.360744 -2.351174 1.32123
H  5.822499 -3.303127 -0.085735
H  3.382223 -3.997876 1.713622
H  3.962694 -4.88626 0.308482
H  2.288143 -4.361957 0.379749
H  1.485917 -2.141787 -1.897954
H  0.849885 -1.594805 2.304234
H  2.931194 1.97654 -1.165796
H  -0.909685 -2.510463 -2.21547
H  -1.556974 -1.97053 1.989928
H  0.504528 0.832998 -1.148755
H  1.618918 4.251682 1.218888
H  -0.744722 4.901335 1.343335
H  -2.487295 3.548862 0.259476
H  -2.513222 0.936904 1.46124
H  -4.109085 0.951698 -2.521951
H  -4.704246 0.261734 2.331509
H  -6.305385 0.249352 -1.638002
H  -6.615689 -0.093971 0.798119
elementType: Cl O N C H
totalener: -1706.65570130 hartree
nucrepener: 3046.44304918 hartree
electener: -4753.09875048 hartree
oneelecener: -8387.40997998 hartree
twoeener: 3634.31122950 hartree
cpcmener: -0.03035118 hartree
kineticenergy: 1700.53396138 hartree
xcener: -142.760264962030 hartree
chargesum: -0.0000000
charge: -0.096869 -0.274859 -0.419971 -0.326545 -0.082994 0.139182 0.061143 -0.027389 -0.292460 -0.310678 0.348409 -0.208991 -0.168818 0.436215 -0.161021 -0.185009 -0.037611 0.142234 -0.255136 -0.169347 0.244768 -0.244763 -0.126957 -0.180233 0.346048 -0.224100 -0.281931 -0.140888 -0.107610 -0.193056 0.096648 0.045980 0.095332 0.089030 0.092984 0.089779 0.098247 0.097761 0.141946 0.138577 0.143101 0.141603 0.143943 0.163643 0.137264 0.160783 0.156959 0.150607 0.143767 0.157207 0.157165 0.156912
qa: -0.0969 -0.2749 -0.4200 -0.3265 -0.0830 0.1392 0.0611 -0.0274 -0.2925 -0.3107 0.3484 -0.2090 -0.1688 0.4362 -0.1610 -0.1850 -0.0376 0.1422 -0.2551 -0.1693 0.2448 -0.2448 -0.1270 -0.1802 0.3460 -0.2241 -0.2819 -0.1409 -0.1076 -0.1931 0.0966 0.0460 0.0953 0.0890 0.0930 0.0898 0.0982 0.0978 0.1419 0.1386 0.1431 0.1416 0.1439 0.1636 0.1373 0.1608 0.1570 0.1506 0.1438 0.1572 0.1572 0.1569
va: 1.2106 2.1373 2.0825 2.0457 3.1138 3.6560 3.8146 3.4506 3.9276 3.9485 4.2395 3.9575 3.9799 3.6983 4.0294 3.9741 3.8554 3.7668 3.9975 3.9193 3.7764 4.0831 3.9276 3.9340 3.5264 3.8706 4.0310 3.8960 3.8705 3.9108 1.0375 1.0264 1.0141 1.0020 1.0044 1.0022 1.0046 1.0008 1.0156 1.0046 1.0265 1.0074 1.0047 0.9994 1.0155 0.9909 0.9959 1.0013 1.0091 0.9896 0.9881 0.9898
dispcorr: -0.033192181 hartree
energy: -1706.688893479663
dipole: 14.02619 -15.26691 -1.24073 -10.70603 9.92456 -0.78147 5.19666 -4.66283 0.53384
magnitude: 1.56048 au
magnitude: 3.96641 debye
