program: Orca
programVersion: 5.0.2
elementType: Cl O O O N C C C C C C C C C C C C C C C C C C C C C C C C C H H H H H H H H H H H H H H H H H H H H H H
charge: 0
multiplicity: 1
keywords: wb97x-d3
keywords: def2-TZVPP
keywords: def2/J RIJCOSX
keywords: DEFGRID2
keywords: scfconv7
keywords: smallprint printgap noloewdin
keywords: NOSOSCF
formula: C25H22ClNO3
InChI: InChI=1/C25H22ClNO3/c1-17(2)24(18-11-13-20(26)14-12-18)25(28)30-23(16-27)19-7-6-10-22(15-19)29-21-8-4-3-5-9-21/h3-15,17,23-24H,1-2H3
52 atoms
Cl -3.126805 -2.982656 1.634641
O  2.470927 0.753745 0.128249
O  2.357312 -0.089269 -1.947028
O  -2.452125 2.019826 0.647683
N  4.580431 3.299119 0.267379
C  2.486999 -1.586433 -0.052538
C  3.129734 -2.688945 -0.910291
C  1.062255 -1.892942 0.363992
C  4.589083 -2.358988 -1.207769
C  3.034801 -4.035014 -0.202268
C  2.451657 -0.254325 -0.7621
C  0.067855 -2.112355 -0.586754
C  0.727047 -1.976592 1.709827
C  2.34873 2.088099 -0.34693
C  -1.223349 -2.43917 -0.20503
C  -0.561478 -2.299496 2.109337
C  1.118381 2.74751 0.238354
C  -1.526002 -2.537406 1.144652
C  -0.081071 2.042851 0.192063
C  1.151756 4.040073 0.74181
C  -1.247162 2.654517 0.628396
C  3.593469 2.772198 0.008754
C  -0.021009 4.62934 1.19456
C  -1.223168 3.94873 1.133666
C  -2.853726 1.16997 -0.34474
C  -2.432362 1.276555 -1.664988
C  -3.786098 0.208409 0.023067
C  -2.941758 0.396143 -2.610062
C  -4.299845 -0.649904 -0.936436
C  -3.876362 -0.566544 -2.255879
H  3.085488 -1.469266 0.856206
H  2.586717 -2.759586 -1.857638
H  5.044395 -3.146979 -1.809493
H  4.710708 -1.426147 -1.759791
H  5.167989 -2.275551 -0.284659
H  2.003955 -4.358661 -0.055535
H  3.516173 -4.00243 0.778339
H  3.535841 -4.807053 -0.787966
H  0.294184 -2.045355 -1.643955
H  1.48341 -1.801376 2.464918
H  2.276862 2.10217 -1.439387
H  -1.98042 -2.621866 -0.955058
H  -0.801624 -2.370344 3.161743
H  -0.113707 1.029256 -0.188728
H  2.076592 4.600536 0.786099
H  0.004234 5.635551 1.591441
H  -2.13982 4.410396 1.47847
H  -1.722949 2.034961 -1.969462
H  -4.107963 0.138725 1.054425
H  -2.607635 0.477283 -3.636483
H  -5.027844 -1.39553 -0.645093
H  -4.272141 -1.243614 -3.001476
elementType: Cl O N C H
totalener: -1706.65600476 hartree
nucrepener: 3047.54001532 hartree
electener: -4754.19602007 hartree
oneelecener: -8389.27185874 hartree
twoeener: 3635.07583867 hartree
cpcmener: -0.02920402 hartree
kineticenergy: 1700.52585962 hartree
xcener: -142.760056944614 hartree
chargesum: -0.0000000
charge: -0.096054 -0.278399 -0.418222 -0.319431 -0.084201 0.140124 0.063356 -0.072431 -0.291979 -0.313478 0.342670 -0.126660 -0.157057 0.420530 -0.249491 -0.162994 -0.029024 0.155172 -0.231915 -0.198042 0.307968 -0.229775 -0.100943 -0.245071 0.357996 -0.239262 -0.266893 -0.138893 -0.119303 -0.192132 0.094434 0.046689 0.093356 0.095537 0.089212 0.098330 0.090497 0.098520 0.140266 0.139333 0.142558 0.151023 0.141681 0.150091 0.136899 0.159192 0.144785 0.157754 0.139786 0.158194 0.149413 0.156284
qa: -0.0961 -0.2784 -0.4182 -0.3194 -0.0842 0.1401 0.0634 -0.0724 -0.2920 -0.3135 0.3427 -0.1267 -0.1571 0.4205 -0.2495 -0.1630 -0.0290 0.1552 -0.2319 -0.1980 0.3080 -0.2298 -0.1009 -0.2451 0.3580 -0.2393 -0.2669 -0.1389 -0.1193 -0.1921 0.0944 0.0467 0.0934 0.0955 0.0892 0.0983 0.0905 0.0985 0.1403 0.1393 0.1426 0.1510 0.1417 0.1501 0.1369 0.1592 0.1448 0.1578 0.1398 0.1582 0.1494 0.1563
va: 1.2115 2.1420 2.0869 2.0992 3.1100 3.6742 3.8063 3.5105 3.9268 3.9511 4.2459 3.8988 3.9768 3.7350 4.0266 4.0217 3.8179 3.7702 3.9417 3.9363 3.7111 4.0704 3.9177 4.0192 3.6288 3.9068 3.9225 3.8629 3.8149 3.8742 1.0389 1.0266 1.0045 1.0137 1.0022 1.0002 1.0020 1.0046 1.0185 1.0031 1.0247 1.0063 1.0073 0.9913 1.0162 0.9896 1.0077 0.9955 1.0176 0.9901 0.9998 0.9909
dispcorr: -0.032738041 hartree
energy: -1706.688742796600
dipole: 16.43325 -17.04698 -0.61373 -10.23921 9.48841 -0.75080 -9.76374 9.56108 -0.20267
magnitude: 0.99068 au
magnitude: 2.51810 debye
