program: Orca
programVersion: 5.0.2
elementType: Cl O O O N C C C C C C C C C C C C C C C C C C C C C C C C C H H H H H H H H H H H H H H H H H H H H H H
charge: 0
multiplicity: 1
keywords: wb97x-d3
keywords: def2-TZVPP
keywords: def2/J RIJCOSX
keywords: DEFGRID2
keywords: scfconv7
keywords: smallprint printgap noloewdin
keywords: NOSOSCF
formula: C25H22ClNO3
InChI: InChI=1/C25H22ClNO3/c1-17(2)24(18-11-13-20(26)14-12-18)25(28)30-23(16-27)19-7-6-10-22(15-19)29-21-8-4-3-5-9-21/h3-15,17,23-24H,1-2H3
52 atoms
Cl -3.202882 -3.236479 1.15835
O  2.240334 0.438515 -0.915495
O  3.020946 0.73064 1.148567
O  -2.305089 1.983808 0.795386
N  4.60866 2.864751 -0.922948
C  2.521496 -1.511262 0.397629
C  3.232953 -2.252692 -0.752056
C  1.064977 -1.892981 0.563779
C  4.688203 -1.809297 -0.856027
C  3.15122 -3.756548 -0.522828
C  2.633478 -0.011273 0.284718
C  0.15389 -1.846233 -0.489888
C  0.61909 -2.331219 1.805732
C  2.208288 1.842168 -1.112173
C  -1.165076 -2.235692 -0.31201
C  -0.693897 -2.733607 1.999576
C  1.16328 2.535976 -0.263391
C  -1.574657 -2.690004 0.93276
C  -0.074326 1.916254 -0.130248
C  1.392568 3.775774 0.315437
C  -1.082893 2.554845 0.575937
C  3.550616 2.415536 -0.9637
C  0.373707 4.39823 1.023131
C  -0.866611 3.798722 1.154359
C  -2.940226 1.228201 -0.157462
C  -3.818127 0.263563 0.319091
C  -2.791882 1.43684 -1.52368
C  -4.555444 -0.494797 -0.577501
C  -3.521868 0.654871 -2.408353
C  -4.406245 -0.309886 -1.945087
H  3.038695 -1.770234 1.325356
H  2.729084 -2.021475 -1.69475
H  4.794212 -0.748859 -1.09436
H  5.222848 -1.996061 0.077926
H  5.198386 -2.363551 -1.644504
H  3.603247 -4.033462 0.432239
H  3.686309 -4.289821 -1.309327
H  2.123054 -4.118984 -0.524012
H  0.461068 -1.514166 -1.473044
H  1.308308 -2.373026 2.639827
H  1.943314 1.960403 -2.166258
H  -1.857941 -2.195163 -1.142115
H  -1.016728 -3.085552 2.969848
H  -0.254033 0.944731 -0.573154
H  2.352162 4.267442 0.223999
H  0.54982 5.3644 1.47633
H  -1.661491 4.286038 1.703821
H  -3.927882 0.114802 1.385802
H  -2.124035 2.196598 -1.907874
H  -5.244406 -1.238245 -0.200558
H  -3.39981 0.81311 -3.471849
H  -4.97716 -0.907562 -2.642958
elementType: Cl O N C H
totalener: -1706.64191913 hartree
nucrepener: 3065.16731072 hartree
electener: -4771.80922986 hartree
oneelecener: -8424.83923743 hartree
twoeener: 3653.03000758 hartree
cpcmener: -0.04062211 hartree
kineticenergy: 1700.52730713 hartree
xcener: -142.764147051566 hartree
chargesum: 0.0000000
charge: -0.098023 -0.280000 -0.434563 -0.333340 -0.091300 0.192434 0.046293 -0.022163 -0.292047 -0.306621 0.335445 -0.219755 -0.188332 0.482118 -0.200498 -0.147550 -0.024562 0.129942 -0.286235 -0.217282 0.328835 -0.242201 -0.095442 -0.260518 0.336720 -0.264571 -0.219123 -0.126957 -0.139518 -0.195130 0.095900 0.057254 0.088368 0.094753 0.094856 0.091993 0.098625 0.098672 0.145508 0.142502 0.146823 0.154168 0.143339 0.159997 0.134855 0.163043 0.147989 0.142472 0.159316 0.152786 0.161879 0.158845
qa: -0.0980 -0.2800 -0.4346 -0.3333 -0.0913 0.1924 0.0463 -0.0222 -0.2920 -0.3066 0.3354 -0.2198 -0.1883 0.4821 -0.2005 -0.1475 -0.0246 0.1299 -0.2862 -0.2173 0.3288 -0.2422 -0.0954 -0.2605 0.3367 -0.2646 -0.2191 -0.1270 -0.1395 -0.1951 0.0959 0.0573 0.0884 0.0948 0.0949 0.0920 0.0986 0.0987 0.1455 0.1425 0.1468 0.1542 0.1433 0.1600 0.1349 0.1630 0.1480 0.1425 0.1593 0.1528 0.1619 0.1588
va: 1.2096 2.1196 2.0663 2.0841 3.0971 3.6132 3.8212 3.5498 3.9450 3.9334 4.1903 3.9227 4.0258 3.8091 3.9647 4.0008 3.7739 3.7879 3.9741 3.9500 3.6799 4.1074 3.8944 4.0260 3.6214 3.9149 3.8908 3.8343 3.8797 3.8967 1.0326 1.0220 1.0099 1.0029 1.0044 1.0021 1.0048 1.0005 1.0181 1.0028 0.9897 1.0003 1.0065 1.0086 1.0170 0.9880 1.0062 1.0143 0.9954 0.9985 0.9887 0.9909
dispcorr: -0.033488215 hartree
energy: -1706.675407349027
dipole: 16.04318 -17.16425 -1.12107 -7.44260 6.36572 -1.07688 -8.92277 7.40742 -1.51534
magnitude: 2.17088 au
magnitude: 5.51795 debye
