program: Orca
programVersion: 5.0.2
elementType: Cl O O O N C C C C C C C C C C C C C C C C C C C C C C C C C H H H H H H H H H H H H H H H H H H H H H H
charge: 0
multiplicity: 1
keywords: wb97x-d3
keywords: def2-TZVPP
keywords: def2/J RIJCOSX
keywords: DEFGRID2
keywords: scfconv7
keywords: smallprint printgap noloewdin
keywords: NOSOSCF
formula: C25H22ClNO3
InChI: InChI=1/C25H22ClNO3/c1-17(2)24(18-11-13-20(26)14-12-18)25(28)30-23(16-27)19-7-6-10-22(15-19)29-21-8-4-3-5-9-21/h3-15,17,23-24H,1-2H3
52 atoms
Cl -0.386794 -3.280782 3.970412
O  2.416179 0.788384 -0.403356
O  1.358207 -0.263909 -2.067073
O  -3.406015 1.018688 -0.424615
N  2.542504 3.856902 0.797827
C  2.953224 -1.480696 -0.710705
C  3.209703 -2.507207 -1.821632
C  2.137024 -2.001896 0.457915
C  4.104334 -1.909473 -2.902836
C  3.85746 -3.75821 -1.241279
C  2.171675 -0.277988 -1.181238
C  0.850415 -2.499384 0.264194
C  2.634556 -1.92584 1.753149
C  1.448965 1.83555 -0.443669
C  0.073037 -2.904344 1.337207
C  1.870574 -2.328083 2.839271
C  0.175297 1.411859 0.250327
C  0.590239 -2.807661 2.61973
C  -1.026662 1.45804 -0.43997
C  0.23155 0.934274 1.555699
C  -2.189521 1.042191 0.198903
C  2.073529 2.958823 0.254204
C  -0.932042 0.497692 2.166914
C  -2.145461 0.555844 1.497546
C  -3.753036 1.987294 -1.333774
C  -4.501317 1.576645 -2.427913
C  -3.440085 3.328331 -1.149673
C  -4.940411 2.519072 -3.346683
C  -3.873745 4.257142 -2.085186
C  -4.623857 3.860885 -3.184566
H  3.918236 -1.13958 -0.323711
H  2.253278 -2.791022 -2.27069
H  3.668668 -1.027199 -3.373001
H  5.072406 -1.620682 -2.487325
H  4.289305 -2.637845 -3.693156
H  4.084477 -4.471008 -2.035056
H  3.212291 -4.264234 -0.522909
H  4.795602 -3.517101 -0.735791
H  0.43254 -2.568278 -0.732484
H  3.631921 -1.540753 1.925219
H  1.24567 2.158884 -1.469148
H  -0.927264 -3.280656 1.171265
H  2.271509 -2.258507 3.84134
H  -1.047128 1.812402 -1.463316
H  1.171099 0.898125 2.092681
H  -0.89958 0.115156 3.178218
H  -3.055797 0.222275 1.978896
H  -4.742531 0.528859 -2.554497
H  -2.8703 3.654768 -0.289035
H  -5.527712 2.197294 -4.196673
H  -3.626926 5.301335 -1.944839
H  -4.961469 4.592401 -3.906267
elementType: Cl O N C H
totalener: -1706.64308174 hartree
nucrepener: 2972.02513439 hartree
electener: -4678.66821614 hartree
oneelecener: -8238.64911367 hartree
twoeener: 3559.98089754 hartree
cpcmener: -0.03662107 hartree
kineticenergy: 1700.52114883 hartree
xcener: -142.757489078900 hartree
chargesum: 0.0000000
charge: -0.101132 -0.276889 -0.439601 -0.335649 -0.098450 0.148650 0.061995 -0.009724 -0.294093 -0.312520 0.328869 -0.184045 -0.197514 0.409849 -0.182271 -0.145632 0.069128 0.116315 -0.201719 -0.289686 0.299129 -0.224728 -0.128774 -0.223667 0.303588 -0.262252 -0.204257 -0.119189 -0.142126 -0.194044 0.098649 0.046579 0.094024 0.089589 0.094235 0.098313 0.097833 0.091420 0.144532 0.141457 0.142285 0.144404 0.143249 0.149073 0.155408 0.155776 0.149212 0.148563 0.159798 0.161996 0.162647 0.161397
qa: -0.1011 -0.2769 -0.4396 -0.3356 -0.0985 0.1487 0.0620 -0.0097 -0.2941 -0.3125 0.3289 -0.1840 -0.1975 0.4098 -0.1823 -0.1456 0.0691 0.1163 -0.2017 -0.2897 0.2991 -0.2247 -0.1288 -0.2237 0.3036 -0.2623 -0.2043 -0.1192 -0.1421 -0.1940 0.0986 0.0466 0.0940 0.0896 0.0942 0.0983 0.0978 0.0914 0.1445 0.1415 0.1423 0.1444 0.1432 0.1491 0.1554 0.1558 0.1492 0.1486 0.1598 0.1620 0.1626 0.1614
va: 1.2006 2.1511 2.0531 2.0738 3.1098 3.6587 3.8105 3.4682 3.9290 3.9491 4.2667 3.9267 3.9764 3.7345 3.9933 3.9811 3.5341 3.7569 3.9580 3.9604 3.7213 4.0881 3.8750 4.0100 3.6658 4.0115 3.9130 3.8743 3.8810 3.9045 1.0381 1.0273 1.0128 1.0019 1.0044 1.0043 1.0006 1.0017 1.0151 1.0038 1.0161 1.0075 1.0058 1.0087 1.0041 0.9932 1.0051 1.0078 0.9959 0.9877 0.9891 0.9896
dispcorr: -0.031414643 hartree
energy: -1706.674496386667
dipole: 11.98995 -11.74358 0.24637 -4.52776 3.64038 -0.88738 -22.20117 21.39363 -0.80754
magnitude: 1.22485 au
magnitude: 3.11333 debye
