program: Orca
programVersion: 5.0.2
elementType: Cl O O O N C C C C C C C C C C C C C C C C C C C C C C C C C H H H H H H H H H H H H H H H H H H H H H H
charge: 0
multiplicity: 1
keywords: wb97x-d3
keywords: def2-TZVPP
keywords: def2/J RIJCOSX
keywords: DEFGRID2
keywords: scfconv7
keywords: smallprint printgap noloewdin
keywords: NOSOSCF
formula: C25H22ClNO3
InChI: InChI=1/C25H22ClNO3/c1-17(2)24(18-11-13-20(26)14-12-18)25(28)30-23(16-27)19-7-6-10-22(15-19)29-21-8-4-3-5-9-21/h3-15,17,23-24H,1-2H3
52 atoms
Cl -2.168322 -3.293121 3.240219
O  1.993396 0.542412 -0.362474
O  3.820688 -0.253645 0.632329
O  -2.419122 2.996999 -0.811768
N  2.122981 1.915724 2.736262
C  2.325249 -1.790151 -0.488776
C  1.995937 -1.828973 -1.992459
C  1.173688 -2.170928 0.421182
C  3.205343 -1.399477 -2.816162
C  1.557246 -3.232513 -2.389288
C  2.828322 -0.444857 -0.021804
C  -0.104594 -1.641073 0.257196
C  1.397114 -3.050043 1.475392
C  2.263557 1.849876 0.122753
C  -1.133113 -1.981578 1.120753
C  0.37833 -3.403688 2.348437
C  1.218167 2.772672 -0.449927
C  -0.8820 -2.861916 2.161733
C  -0.124652 2.43023 -0.340313
C  1.602562 3.94976 -1.073491
C  -1.08106 3.267258 -0.893363
C  2.194231 1.86206 1.5894
C  0.628951 4.792501 -1.593579
C  -0.711142 4.452802 -1.517464
C  -2.854755 1.694101 -0.884586
C  -3.844715 1.303707 0.004323
C  -2.370561 0.81431 -1.845131
C  -4.361566 0.017731 -0.075091
C  -2.886226 -0.472188 -1.903105
C  -3.882123 -0.87612 -1.02257
H  3.144205 -2.491824 -0.308914
H  1.172516 -1.140201 -2.200886
H  3.515162 -0.37334 -2.60888
H  4.060751 -2.051175 -2.626105
H  2.97899 -1.454257 -3.881522
H  2.342928 -3.962197 -2.18116
H  1.340001 -3.274487 -3.457229
H  0.657751 -3.550126 -1.861318
H  -0.324924 -0.959177 -0.554182
H  2.382919 -3.474354 1.62046
H  3.263663 2.182422 -0.170406
H  -2.119668 -1.561773 0.976499
H  0.571506 -4.092936 3.159088
H  -0.419713 1.521562 0.171656
H  2.650472 4.206884 -1.155861
H  0.918621 5.713481 -2.081081
H  -1.469359 5.100206 -1.93885
H  -4.211591 2.001297 0.746535
H  -1.602605 1.122542 -2.543474
H  -5.135236 -0.286768 0.617436
H  -2.505507 -1.160689 -2.64619
H  -4.279323 -1.880974 -1.073324
elementType: Cl O N C H
totalener: -1706.64369302 hartree
nucrepener: 3035.62069026 hartree
electener: -4742.26438328 hartree
oneelecener: -8365.26005565 hartree
twoeener: 3622.99567237 hartree
cpcmener: -0.04128893 hartree
kineticenergy: 1700.52923803 hartree
xcener: -142.758970215120 hartree
chargesum: 0.0000000
charge: -0.095028 -0.269209 -0.440169 -0.339618 -0.096074 0.163117 0.037007 0.000144 -0.297091 -0.300547 0.345128 -0.242879 -0.190830 0.403421 -0.099793 -0.149289 0.011455 0.068592 -0.197942 -0.207537 0.241315 -0.225343 -0.111905 -0.233306 0.293714 -0.251330 -0.192821 -0.102158 -0.143210 -0.207723 0.098480 0.052887 0.090306 0.095616 0.095927 0.092391 0.097463 0.099059 0.137758 0.142495 0.138140 0.134626 0.143782 0.158059 0.149537 0.162730 0.151180 0.148110 0.158415 0.159851 0.162364 0.160735
qa: -0.0950 -0.2692 -0.4402 -0.3396 -0.0961 0.1631 0.0370 0.0001 -0.2971 -0.3005 0.3451 -0.2429 -0.1908 0.4034 -0.0998 -0.1493 0.0115 0.0686 -0.1979 -0.2075 0.2413 -0.2253 -0.1119 -0.2333 0.2937 -0.2513 -0.1928 -0.1022 -0.1432 -0.2077 0.0985 0.0529 0.0903 0.0956 0.0959 0.0924 0.0975 0.0991 0.1378 0.1425 0.1381 0.1346 0.1438 0.1581 0.1495 0.1627 0.1512 0.1481 0.1584 0.1599 0.1624 0.1607
va: 1.2152 2.1539 2.0609 2.0717 3.1105 3.6193 3.8446 3.5714 3.9386 3.9276 4.2100 4.0067 4.0021 3.7487 3.9327 3.9721 3.7095 3.9000 3.9361 3.9563 3.7874 4.0323 3.8907 4.0067 3.6589 4.0088 3.8727 3.8224 3.8067 3.8527 1.0309 1.0205 1.0106 1.0028 1.0035 1.0023 1.0049 1.0009 1.0017 1.0041 1.0185 1.0198 1.0059 1.0062 1.0014 0.9879 1.0042 1.0065 0.9964 0.9884 0.9901 0.9905
dispcorr: -0.032284952 hartree
energy: -1706.675977971282
dipole: 9.63486 -9.68134 -0.04649 -4.84094 4.67111 -0.16983 -26.97419 23.66658 -3.30760
magnitude: 3.31229 au
magnitude: 8.41916 debye
