program: Orca
programVersion: 5.0.2
elementType: Cl O O O N C C C C C C C C C C C C C C C C C C C C C C C C C H H H H H H H H H H H H H H H H H H H H H H
charge: 0
multiplicity: 1
keywords: wb97x-d3
keywords: def2-TZVPP
keywords: def2/J RIJCOSX
keywords: DEFGRID2
keywords: scfconv7
keywords: smallprint printgap noloewdin
keywords: NOSOSCF
formula: C25H22ClNO3
InChI: InChI=1/C25H22ClNO3/c1-17(2)24(18-11-13-20(26)14-12-18)25(28)30-23(16-27)19-7-6-10-22(15-19)29-21-8-4-3-5-9-21/h3-15,17,23-24H,1-2H3
52 atoms
Cl 0.988438 -5.167593 3.851648
O  1.425589 0.436101 0.441416
O  3.009644 0.37544 -1.129134
O  -2.314255 3.570474 -1.337554
N  0.999443 2.160387 3.218781
C  1.515596 -1.504927 -0.906192
C  0.204256 -1.34069 -1.714879
C  1.370745 -2.388733 0.311899
C  0.416864 -0.458406 -2.940994
C  -0.311454 -2.709439 -2.139251
C  2.087918 -0.151128 -0.562112
C  2.28006 -3.422261 0.50942
C  0.338101 -2.230476 1.23472
C  1.763125 1.784607 0.748099
C  2.175227 -4.281233 1.594407
C  0.21848 -3.077279 2.324735
C  1.065139 2.744948 -0.18297
C  1.140607 -4.099063 2.495331
C  -0.318058 2.677023 -0.314731
C  1.805054 3.665235 -0.908759
C  -0.955161 3.544664 -1.188612
C  1.330948 1.982592 2.132246
C  1.14956 4.536778 -1.768314
C  -0.225429 4.476486 -1.918137
C  -3.036522 2.402784 -1.253876
C  -2.643093 1.254156 -1.928265
C  -4.212651 2.429704 -0.520259
C  -3.434788 0.117856 -1.849821
C  -5.003971 1.290171 -0.463788
C  -4.616981 0.129918 -1.12023
H  2.24763 -1.967708 -1.573455
H  -0.548269 -0.867476 -1.075969
H  -0.48294 -0.4506 -3.557383
H  0.636743 0.579688 -2.685792
H  1.234513 -0.833522 -3.560417
H  0.421654 -3.228061 -2.76126
H  -1.225865 -2.602124 -2.724428
H  -0.541763 -3.35047 -1.28864
H  3.085722 -3.571456 -0.198765
H  -0.401853 -1.450836 1.110347
H  2.84515 1.943006 0.718307
H  2.890339 -5.081947 1.725163
H  -0.590662 -2.940308 3.029248
H  -0.888216 1.960474 0.265492
H  2.881265 3.704276 -0.80227
H  1.716326 5.260092 -2.338683
H  -0.735976 5.149833 -2.594662
H  -1.73333 1.242082 -2.514485
H  -4.509291 3.333938 -0.004218
H  -3.125491 -0.779111 -2.371701
H  -5.924469 1.311709 0.104542
H  -5.233103 -0.757541 -1.066973
elementType: Cl O N C H
totalener: -1706.64260092 hartree
nucrepener: 2979.43342040 hartree
electener: -4686.07602132 hartree
oneelecener: -8252.62030743 hartree
twoeener: 3566.54428612 hartree
cpcmener: -0.03899283 hartree
kineticenergy: 1700.51954492 hartree
xcener: -142.756234308337 hartree
chargesum: -0.0000000
charge: -0.101281 -0.262945 -0.438154 -0.339722 -0.095974 0.180604 0.044059 -0.013554 -0.337603 -0.301252 0.344195 -0.183531 -0.240544 0.392631 -0.152104 -0.146788 0.049567 0.098093 -0.232492 -0.205935 0.264473 -0.226495 -0.109243 -0.240730 0.291192 -0.233916 -0.247798 -0.135359 -0.118725 -0.198384 0.091286 0.038144 0.098985 0.095356 0.116974 0.098567 0.096620 0.100307 0.142770 0.142529 0.142909 0.143673 0.143702 0.151384 0.149962 0.162861 0.150806 0.190257 0.148925 0.170478 0.161368 0.159854
qa: -0.1013 -0.2629 -0.4382 -0.3397 -0.0960 0.1806 0.0441 -0.0136 -0.3376 -0.3013 0.3442 -0.1835 -0.2405 0.3926 -0.1521 -0.1468 0.0496 0.0981 -0.2325 -0.2059 0.2645 -0.2265 -0.1092 -0.2407 0.2912 -0.2339 -0.2478 -0.1354 -0.1187 -0.1984 0.0913 0.0381 0.0990 0.0954 0.1170 0.0986 0.0966 0.1003 0.1428 0.1425 0.1429 0.1437 0.1437 0.1514 0.1500 0.1629 0.1508 0.1903 0.1489 0.1705 0.1614 0.1599
va: 1.2032 2.1362 2.0626 2.0744 3.1084 3.6270 3.8033 3.5662 3.9469 3.9280 4.2261 3.9973 3.9913 3.7564 3.9839 4.0094 3.5681 3.8157 3.9241 3.9626 3.7475 4.0815 3.8914 4.0149 3.7101 3.9102 4.0064 3.8553 3.8723 3.9285 1.0373 1.0260 0.9959 0.9995 1.0077 1.0012 1.0074 1.0005 1.0032 1.0083 1.0169 1.0059 1.0059 1.0106 1.0032 0.9876 1.0045 0.9763 1.0065 0.9848 0.9872 0.9910
dispcorr: -0.031945253 hartree
energy: -1706.674546173075
dipole: -8.96752 8.64358 -0.32393 3.72065 -4.00517 -0.28452 -27.89071 25.61250 -2.27821
magnitude: 2.31865 au
magnitude: 5.89354 debye
