program: Orca
programVersion: 5.0.2
elementType: Cl O O O N C C C C C C C C C C C C C C C C C C C C C C C C C H H H H H H H H H H H H H H H H H H H H H H
charge: 0
multiplicity: 1
keywords: wb97x-d3
keywords: def2-TZVPP
keywords: def2/J RIJCOSX
keywords: DEFGRID2
keywords: scfconv7
keywords: smallprint printgap noloewdin
keywords: NOSOSCF
formula: C25H22ClNO3
InChI: InChI=1/C25H22ClNO3/c1-17(2)24(18-11-13-20(26)14-12-18)25(28)30-23(16-27)19-7-6-10-22(15-19)29-21-8-4-3-5-9-21/h3-15,17,23-24H,1-2H3
52 atoms
Cl -2.435744 -3.013285 2.68309
O  2.465409 0.623799 0.607788
O  2.916649 0.515103 -1.573944
O  -2.349159 2.333468 0.171228
N  2.743966 2.84026 3.030001
C  2.582717 -1.534551 -0.304879
C  2.821341 -2.35878 -1.585774
C  1.319269 -1.892888 0.441502
C  3.124163 -3.80714 -1.219263
C  1.687817 -2.300462 -2.602317
C  2.666999 -0.043506 -0.539358
C  0.07158 -1.439745 0.018046
C  1.380006 -2.70487 1.568594
C  2.516461 2.042222 0.551694
C  -1.084882 -1.782602 0.69972
C  0.232683 -3.061083 2.263329
C  1.274369 2.648407 -0.057071
C  -0.992437 -2.592397 1.820213
C  0.021175 2.184367 0.324512
C  1.391658 3.68543 -0.971434
C  -1.106178 2.771836 -0.22301
C  2.646835 2.470893 1.945199
C  0.249927 4.273668 -1.496384
C  -1.006484 3.817008 -1.128626
C  -2.88767 1.242493 -0.458554
C  -4.012742 0.684943 0.139766
C  -2.374333 0.70707 -1.633179
C  -4.625364 -0.411397 -0.445172
C  -2.999631 -0.394995 -2.204113
C  -4.122315 -0.960042 -1.618952
H  3.425172 -1.749508 0.364761
H  3.72019 -1.945886 -2.052689
H  3.964485 -3.881126 -0.526797
H  2.26483 -4.295578 -0.755725
H  3.381223 -4.378572 -2.112107
H  0.795805 -2.814309 -2.240946
H  1.995719 -2.800854 -3.521631
H  1.403146 -1.282255 -2.867174
H  -0.016379 -0.800705 -0.852525
H  2.339067 -3.064708 1.920049
H  3.407786 2.387495 0.01783
H  -2.04496 -1.417592 0.360711
H  0.301513 -3.690323 3.140222
H  -0.086714 1.380358 1.043329
H  2.371549 4.037638 -1.267224
H  0.338966 5.085675 -2.205087
H  -1.901139 4.265926 -1.540444
H  -4.40176 1.109847 1.05654
H  -1.499966 1.128741 -2.111328
H  -5.499676 -0.841992 0.025163
H  -2.595485 -0.811403 -3.117603
H  -4.600566 -1.818887 -2.070073
elementType: Cl O N C H
totalener: -1706.64260925 hartree
nucrepener: 3064.97744063 hartree
electener: -4771.62004989 hartree
oneelecener: -8424.29734431 hartree
twoeener: 3652.67729442 hartree
cpcmener: -0.03856011 hartree
kineticenergy: 1700.53097853 hartree
xcener: -142.761646040817 hartree
chargesum: -0.0000000
charge: -0.096230 -0.281641 -0.439839 -0.341548 -0.099317 0.112588 0.084181 0.131930 -0.329425 -0.321075 0.367359 -0.385910 -0.226626 0.396473 -0.012115 -0.109735 0.020229 0.008561 -0.215758 -0.169318 0.207137 -0.222158 -0.132121 -0.165343 0.316815 -0.245025 -0.221358 -0.112568 -0.151849 -0.198070 0.102994 0.046577 0.099882 0.088874 0.102181 0.086680 0.107823 0.094021 0.178606 0.144561 0.147984 0.089729 0.143202 0.160505 0.149957 0.163731 0.153583 0.144961 0.150562 0.157069 0.159904 0.158368
qa: -0.0962 -0.2816 -0.4398 -0.3415 -0.0993 0.1126 0.0842 0.1319 -0.3294 -0.3211 0.3674 -0.3859 -0.2266 0.3965 -0.0121 -0.1097 0.0202 0.0086 -0.2158 -0.1693 0.2071 -0.2222 -0.1321 -0.1653 0.3168 -0.2450 -0.2214 -0.1126 -0.1518 -0.1981 0.1030 0.0466 0.0999 0.0889 0.1022 0.0867 0.1078 0.0940 0.1786 0.1446 0.1480 0.0897 0.1432 0.1605 0.1500 0.1637 0.1536 0.1450 0.1506 0.1571 0.1599 0.1584
va: 1.2155 2.1359 2.0579 2.0617 3.1102 3.7750 3.8333 3.4295 3.9454 3.9359 4.2156 3.9599 3.9933 3.7376 3.8316 3.9395 3.5702 3.9664 4.0243 3.9533 3.7787 4.0917 3.8811 3.9781 3.6341 3.9638 3.8095 3.8627 3.8706 3.8728 1.0274 1.0251 1.0017 0.9991 1.0041 0.9968 1.0056 1.0153 0.9669 1.0006 1.0147 1.0194 1.0042 0.9977 1.0005 0.9882 0.9985 1.0097 1.0059 0.9894 0.9916 0.9909
dispcorr: -0.033633566 hartree
energy: -1706.676242818179
dipole: 10.27751 -9.52109 0.75642 -10.49172 9.81010 -0.68163 -22.85407 20.82546 -2.02861
magnitude: 2.26981 au
magnitude: 5.76940 debye
