program: Orca
programVersion: 5.0.2
elementType: F F O O O O N C C C C C C C C C C C C C C C C C C C C C C C C C C H H H H H H H H H H H H H H H H H H H H H H H
charge: 0
multiplicity: 1
keywords: wb97x-d3
keywords: def2-TZVPP
keywords: def2/J RIJCOSX
keywords: DEFGRID2
keywords: scfconv7
keywords: smallprint printgap noloewdin
keywords: NOSOSCF
formula: C26H23F2NO4
InChI: InChI=1/C26H23F2NO4/c1-17(2)24(18-11-13-21(14-12-18)32-26(27)28)25(30)33-23(16-29)19-7-6-10-22(15-19)31-20-8-4-3-5-9-20/h3-15,17,23-24,26H,1-2H3
56 atoms
F  -4.926734 -1.969446 -0.022909
F  -3.641588 -2.962267 -1.447284
O  3.203737 0.531982 0.499776
O  3.333734 -0.548097 -1.461908
O  -2.877781 -2.31069 0.549017
O  -1.316928 2.075961 -1.403368
N  5.314222 3.038597 1.025241
C  2.767738 -1.776896 0.536075
C  3.44898 -3.059437 0.028887
C  1.253937 -1.852286 0.503674
C  4.967089 -2.945789 0.131334
C  2.955161 -4.269935 0.813315
C  3.157383 -0.563537 -0.275835
C  0.566533 -1.999542 -0.694889
C  0.514806 -1.818452 1.681001
C  3.33175 1.800962 -0.139174
C  -0.812863 -2.140817 -0.728023
C  -0.861963 -1.952203 1.6671
C  -1.52906 -2.125478 0.461949
C  2.01462 2.533664 -0.041174
C  0.941887 2.009798 -0.757579
C  1.833426 3.647622 0.762402
C  -0.303612 2.600612 -0.657922
C  4.437955 2.495273 0.519742
C  0.579521 4.240283 0.841718
C  -0.493844 3.724004 0.140248
C  -3.681034 -1.993475 -0.501792
C  -2.506457 1.792053 -0.79978
C  -2.588741 1.330989 0.509644
C  -3.653354 1.936494 -1.568896
C  -3.833235 1.036753 1.047212
C  -4.88875 1.627969 -1.01976
C  -4.986667 1.185042 0.291232
H  3.076114 -1.610312 1.573049
H  3.182189 -3.195494 -1.023225
H  5.368707 -2.136496 -0.478019
H  5.443091 -3.866735 -0.206511
H  5.279887 -2.778228 1.164585
H  1.88046 -4.417945 0.713875
H  3.446772 -5.17669 0.459866
H  3.18102 -4.170264 1.877781
H  1.108638 -2.024997 -1.631881
H  1.021839 -1.694642 2.629912
H  3.605134 1.664761 -1.190268
H  -1.296632 -2.296377 -1.681568
H  -1.42635 -1.936849 2.590226
H  1.061702 1.143337 -1.396472
H  2.658351 4.062944 1.32607
H  0.440635 5.116457 1.460384
H  -1.469008 4.189157 0.205517
H  -3.433734 -1.034977 -0.970021
H  -1.694879 1.193244 1.104392
H  -3.570725 2.289568 -2.588513
H  -3.896014 0.674562 2.064591
H  -5.780165 1.741714 -1.622232
H  -5.951325 0.945992 0.716257
totalener: -1560.09470190 hartree
nucrepener: 3441.38318067 hartree
electener: -5001.47788256 hartree
oneelecener: -8973.11291904 hartree
twoeener: 3971.63503647 hartree
kineticenergy: 1553.71081808 hartree
xcener: -146.827998495609 hartree
chargesum: -0.0000000
charge: -0.177679 -0.195632 -0.250611 -0.354580 -0.252540 -0.300390 0.000201 0.089752 0.046015 -0.043344 -0.272910 -0.283616 0.293782 -0.206690 -0.089319 0.330106 -0.142342 -0.210791 0.234394 -0.020547 -0.170868 -0.155795 0.165936 -0.268355 -0.096421 -0.132314 0.395466 0.215873 -0.153281 -0.203962 -0.115990 -0.092997 -0.146724 0.084174 0.050019 0.100549 0.084879 0.083484 0.100901 0.092094 0.077664 0.135413 0.109725 0.136292 0.130405 0.126337 0.136507 0.129048 0.133328 0.135626 0.075420 0.131057 0.128706 0.127527 0.128418 0.128601
qa: -0.1777 -0.1956 -0.2506 -0.3546 -0.2525 -0.3004 0.0002 0.0898 0.0460 -0.0433 -0.2729 -0.2836 0.2938 -0.2067 -0.0893 0.3301 -0.1423 -0.2108 0.2344 -0.0205 -0.1709 -0.1558 0.1659 -0.2684 -0.0964 -0.1323 0.3955 0.2159 -0.1533 -0.2040 -0.1160 -0.0930 -0.1467 0.0842 0.0500 0.1005 0.0849 0.0835 0.1009 0.0921 0.0777 0.1354 0.1097 0.1363 0.1304 0.1263 0.1365 0.1290 0.1333 0.1356 0.0754 0.1311 0.1287 0.1275 0.1284 0.1286
va: 1.1021 1.0795 2.1332 2.1371 2.0760 2.0854 3.1183 3.7597 3.8178 3.5851 3.9289 3.9511 4.2715 4.0165 3.9632 3.7864 3.9269 4.0181 3.8653 3.8403 4.0019 3.9860 3.9143 4.0427 3.9583 3.9645 4.2878 3.7445 3.8371 4.0080 3.8859 3.9152 3.9184 1.0393 1.0253 1.0138 1.0070 1.0043 1.0026 1.0078 1.0051 1.0231 1.0100 1.0253 1.0243 1.0134 1.0237 1.0218 1.0005 1.0024 0.9941 1.0059 1.0145 1.0039 0.9997 1.0027
dispcorr: -0.035299374 hartree
energy: -1560.130001270054
dipole: 19.78559 -20.67407 -0.88848 -7.78338 7.81942 0.03605 6.31886 -6.02352 0.29534
magnitude: 0.93697 au
magnitude: 2.38159 debye
