program: Orca
programVersion: 5.0.2
elementType: F F O O O O N C C C C C C C C C C C C C C C C C C C C C C C C C C H H H H H H H H H H H H H H H H H H H H H H H
charge: 0
multiplicity: 1
keywords: wb97x-d3
keywords: def2-TZVPP
keywords: def2/J RIJCOSX
keywords: DEFGRID2
keywords: scfconv7
keywords: smallprint printgap noloewdin
keywords: NOSOSCF
formula: C26H23F2NO4
InChI: InChI=1/C26H23F2NO4/c1-17(2)24(18-11-13-21(14-12-18)32-26(27)28)25(30)33-23(16-29)19-7-6-10-22(15-19)31-20-8-4-3-5-9-20/h3-15,17,23-24,26H,1-2H3
56 atoms
F  -4.271763 -2.870141 0.438511
F  -3.241777 -4.262484 -0.854196
O  2.654535 0.495526 0.939991
O  3.541779 -0.090354 -1.027291
O  -3.010176 -2.074538 -1.239736
O  -1.591614 2.589595 -1.068621
N  2.820091 3.089768 2.972917
C  2.434564 -1.761073 0.335618
C  3.265963 -2.892509 -0.290547
C  0.974587 -1.799751 -0.063756
C  4.692932 -2.879836 0.25015
C  2.614031 -4.245433 -0.023748
C  2.963908 -0.39005 -0.023021
C  -0.0131 -1.99124 0.892455
C  0.590028 -1.673075 -1.395113
C  2.951559 1.855771 0.672371
C  -1.35185 -2.09172 0.546033
C  -0.740185 -1.787703 -1.759484
C  -1.705639 -2.01184 -0.790711
C  1.98548 2.488585 -0.30215
C  0.630227 2.200379 -0.210529
C  2.459188 3.382824 -1.247989
C  -0.256507 2.832178 -1.072445
C  2.87516 2.531923 1.970475
C  1.563627 4.001662 -2.107024
C  0.209209 3.736328 -2.020886
C  -3.842489 -3.060207 -0.834928
C  -2.215865 2.195992 0.084293
C  -2.043375 2.884141 1.278789
C  -3.074378 1.112052 0.008633
C  -2.733958 2.466246 2.405198
C  -3.765373 0.708676 1.141474
C  -3.594593 1.378883 2.343014
H  2.483773 -1.863913 1.424875
H  3.304725 -2.732778 -1.372095
H  5.277536 -3.685269 -0.195182
H  4.702861 -3.031388 1.332077
H  5.214831 -1.948313 0.034397
H  3.222916 -5.048243 -0.440517
H  2.515594 -4.432567 1.04824
H  1.621103 -4.321985 -0.464793
H  0.261759 -2.068399 1.936958
H  1.332371 -1.493347 -2.162773
H  3.974143 1.961318 0.294013
H  -2.092791 -2.216886 1.320994
H  -1.033911 -1.700566 -2.797153
H  0.26957 1.488831 0.522008
H  3.51846 3.592802 -1.320167
H  1.924147 4.700427 -2.849667
H  -0.495249 4.219569 -2.684775
H  -4.709536 -3.063272 -1.495314
H  -1.3777 3.736349 1.332858
H  -3.200545 0.594844 -0.932336
H  -2.598796 2.999558 3.33676
H  -4.427615 -0.144749 1.082449
H  -4.131077 1.059287 3.226134
totalener: -1560.09244795 hartree
nucrepener: 3453.79609486 hartree
electener: -5013.88854282 hartree
oneelecener: -8998.80754482 hartree
twoeener: 3984.91900201 hartree
kineticenergy: 1553.71971759 hartree
xcener: -146.826002265122 hartree
chargesum: -0.0000000
charge: -0.202779 -0.187399 -0.264506 -0.336392 -0.316768 -0.300636 -0.001300 0.067469 0.058670 -0.059050 -0.276383 -0.279977 0.280572 -0.127218 -0.123410 0.292629 -0.115455 -0.169181 0.208263 0.103181 -0.239866 -0.166919 0.252827 -0.255456 -0.080915 -0.215862 0.415753 0.266407 -0.168303 -0.207892 -0.104821 -0.123199 -0.144456 0.085394 0.046793 0.085570 0.081339 0.098634 0.090827 0.078592 0.101020 0.108297 0.126280 0.125176 0.123064 0.125947 0.135144 0.105156 0.126170 0.127940 0.098280 0.133870 0.133353 0.130791 0.127409 0.127325
qa: -0.2028 -0.1874 -0.2645 -0.3364 -0.3168 -0.3006 -0.0013 0.0675 0.0587 -0.0590 -0.2764 -0.2800 0.2806 -0.1272 -0.1234 0.2926 -0.1155 -0.1692 0.2083 0.1032 -0.2399 -0.1669 0.2528 -0.2555 -0.0809 -0.2159 0.4158 0.2664 -0.1683 -0.2079 -0.1048 -0.1232 -0.1445 0.0854 0.0468 0.0856 0.0813 0.0986 0.0908 0.0786 0.1010 0.1083 0.1263 0.1252 0.1231 0.1259 0.1351 0.1052 0.1262 0.1279 0.0983 0.1339 0.1334 0.1308 0.1274 0.1273
va: 1.0756 1.1022 2.1345 2.1605 2.0586 2.1092 3.1220 3.7780 3.8203 3.5379 3.9337 3.9494 4.2759 3.9923 3.9635 3.8540 3.9938 4.0754 3.7613 3.6075 3.9547 4.0391 3.8057 4.0256 3.9494 4.0456 4.2870 3.7700 3.9578 3.9844 3.9461 3.9011 3.9720 1.0378 1.0269 1.0074 1.0040 1.0144 1.0075 1.0051 1.0035 1.0122 1.0193 1.0181 1.0282 1.0112 1.0109 1.0125 1.0000 1.0124 0.9791 1.0038 1.0173 0.9985 1.0154 1.0000
dispcorr: -0.034841241 hartree
energy: -1560.127289193239
dipole: 21.74967 -22.03051 -0.28083 -5.72784 4.96357 -0.76427 0.83781 -1.71952 -0.88171
magnitude: 1.20016 au
magnitude: 3.05056 debye
