program: Orca
programVersion: 5.0.2
elementType: F F O O O O N C C C C C C C C C C C C C C C C C C C C C C C C C C H H H H H H H H H H H H H H H H H H H H H H H
charge: 0
multiplicity: 1
keywords: wb97x-d3
keywords: def2-TZVPP
keywords: def2/J RIJCOSX
keywords: DEFGRID2
keywords: scfconv7
keywords: smallprint printgap noloewdin
keywords: NOSOSCF
formula: C26H23F2NO4
InChI: InChI=1/C26H23F2NO4/c1-17(2)24(18-11-13-21(14-12-18)32-26(27)28)25(30)33-23(16-29)19-7-6-10-22(15-19)31-20-8-4-3-5-9-20/h3-15,17,23-24,26H,1-2H3
56 atoms
F  -3.789182 -3.008749 0.415329
F  -4.735898 -1.850794 -1.149578
O  3.014595 0.523774 0.432243
O  4.022533 -0.550133 -1.261194
O  -2.593352 -2.06248 -1.207851
O  -1.552551 1.812219 -1.136466
N  5.116054 3.043799 1.062288
C  2.829512 -1.812353 0.426336
C  3.609255 -3.091019 0.084747
C  1.370727 -1.859903 0.018984
C  5.036454 -3.017622 0.619718
C  2.897291 -4.314993 0.650967
C  3.397709 -0.579198 -0.240734
C  0.359996 -1.76028 0.961362
C  1.007399 -1.999959 -1.319681
C  3.19491 1.787684 -0.18712
C  -0.981011 -1.823833 0.605592
C  -0.320785 -2.049476 -1.694826
C  -1.321151 -1.970818 -0.732032
C  1.875103 2.528562 -0.171448
C  0.743705 1.846169 -0.611118
C  1.770903 3.850672 0.230518
C  -0.475657 2.49555 -0.648647
C  4.265936 2.492978 0.520811
C  0.538136 4.490077 0.18677
C  -0.590653 3.82206 -0.24915
C  -3.654625 -1.915839 -0.369991
C  -2.651004 1.654352 -0.348344
C  -3.875717 1.535873 -0.993766
C  -2.575188 1.566844 1.037551
C  -5.026464 1.335144 -0.248651
C  -3.738024 1.373847 1.77028
C  -4.966785 1.2581 1.136165
H  2.871035 -1.661527 1.510649
H  3.653544 -3.188919 -1.003924
H  5.041576 -2.908418 1.706778
H  5.601069 -2.189235 0.193923
H  5.580388 -3.93268 0.384411
H  2.80578 -4.25074 1.737895
H  1.895495 -4.440359 0.241888
H  3.461447 -5.220043 0.424837
H  0.613781 -1.645482 2.007746
H  1.769659 -2.069779 -2.086236
H  3.527772 1.652472 -1.222254
H  -1.725394 -1.778257 1.387778
H  -0.59514 -2.158037 -2.735644
H  0.786858 0.810501 -0.92527
H  2.639615 4.391926 0.581453
H  0.461464 5.522956 0.498162
H  -1.549725 4.322548 -0.285415
H  -3.598872 -1.028291 0.266944
H  -3.917038 1.596193 -2.073155
H  -1.621698 1.645394 1.543642
H  -5.976546 1.240949 -0.756915
H  -3.677089 1.311049 2.848876
H  -5.86805 1.107132 1.714199
totalener: -1560.09432504 hartree
nucrepener: 3448.24934402 hartree
electener: -5008.34366907 hartree
oneelecener: -8986.76039757 hartree
twoeener: 3978.41672850 hartree
kineticenergy: 1553.70567182 hartree
xcener: -146.829709218267 hartree
chargesum: 0.0000000
charge: -0.193597 -0.178136 -0.262054 -0.343379 -0.252138 -0.290631 0.000178 0.070048 0.059495 -0.118898 -0.275089 -0.279882 0.296743 -0.133283 -0.100942 0.346658 -0.149605 -0.188242 0.267001 -0.064015 -0.119122 -0.112926 0.122713 -0.281830 -0.114446 -0.104935 0.454122 0.223070 -0.196845 -0.160285 -0.102991 -0.118849 -0.140800 0.086073 0.044904 0.080135 0.104735 0.084651 0.077497 0.101040 0.091536 0.105185 0.128932 0.137201 0.109840 0.125676 0.108635 0.129228 0.132385 0.135793 0.016614 0.127732 0.128897 0.126814 0.130329 0.129055
qa: -0.1936 -0.1781 -0.2621 -0.3434 -0.2521 -0.2906 0.0002 0.0700 0.0595 -0.1189 -0.2751 -0.2799 0.2967 -0.1333 -0.1009 0.3467 -0.1496 -0.1882 0.2670 -0.0640 -0.1191 -0.1129 0.1227 -0.2818 -0.1144 -0.1049 0.4541 0.2231 -0.1968 -0.1603 -0.1030 -0.1188 -0.1408 0.0861 0.0449 0.0801 0.1047 0.0847 0.0775 0.1010 0.0915 0.1052 0.1289 0.1372 0.1098 0.1257 0.1086 0.1292 0.1324 0.1358 0.0166 0.1277 0.1289 0.1268 0.1303 0.1291
va: 1.0906 1.1072 2.1352 2.1512 2.1025 2.0686 3.1165 3.7675 3.8197 3.5944 3.9330 3.9471 4.2573 4.0289 3.9022 3.7832 3.9089 4.0661 3.8476 3.8788 3.9446 3.9269 3.9729 4.0535 3.9836 3.9571 4.3021 3.6803 3.9867 3.8396 3.8974 3.9092 3.9036 1.0363 1.0265 1.0041 1.0142 1.0070 1.0052 1.0029 1.0079 1.0145 1.0194 1.0216 1.0210 1.0151 1.0212 1.0221 1.0010 1.0025 0.9997 1.0166 1.0135 1.0023 1.0006 1.0016
dispcorr: -0.035591266 hartree
energy: -1560.129916308455
dipole: 19.35697 -20.47380 -1.11683 -7.69516 7.80813 0.11297 7.92373 -7.49452 0.42921
magnitude: 1.20179 au
magnitude: 3.05470 debye
