program: Orca
programVersion: 5.0.2
elementType: F F O O O O N C C C C C C C C C C C C C C C C C C C C C C C C C C H H H H H H H H H H H H H H H H H H H H H H H
charge: 0
multiplicity: 1
keywords: wb97x-d3
keywords: def2-TZVPP
keywords: def2/J RIJCOSX
keywords: DEFGRID2
keywords: scfconv7
keywords: smallprint printgap noloewdin
keywords: NOSOSCF
formula: C26H23F2NO4
InChI: InChI=1/C26H23F2NO4/c1-17(2)24(18-11-13-21(14-12-18)32-26(27)28)25(30)33-23(16-29)19-7-6-10-22(15-19)31-20-8-4-3-5-9-20/h3-15,17,23-24,26H,1-2H3
56 atoms
F  -3.752152 -3.532753 0.726141
F  -4.822707 -1.982887 -0.331576
O  2.827232 0.417086 1.013719
O  3.821032 0.056849 -0.953832
O  -2.717974 -2.221914 -0.754511
O  -1.534998 1.841979 -1.250591
N  2.450038 2.981358 3.078799
C  2.846174 -1.80695 0.255974
C  3.659779 -2.803187 -0.58634
C  1.353288 -1.888391 0.016865
C  5.130098 -2.787557 -0.177658
C  3.0954 -4.213875 -0.448286
C  3.254028 -0.370989 0.009377
C  0.506056 -2.374515 0.999767
C  0.794701 -1.50056 -1.199756
C  2.930733 1.8130 0.792127
C  -0.859132 -2.506077 0.786421
C  -0.565686 -1.601934 -1.422549
C  -1.394364 -2.115803 -0.4326
C  1.943398 2.310378 -0.238814
C  0.642175 1.827049 -0.235799
C  2.341498 3.260403 -1.166691
C  -0.262812 2.317793 -1.166207
C  2.664975 2.444042 2.086972
C  1.428123 3.741307 -2.090739
C  0.123528 3.277485 -2.091106
C  -3.64651 -2.277517 0.234235
C  -2.374654 1.857344 -0.176814
C  -2.135692 2.575585 0.988247
C  -3.550695 1.131098 -0.324396
C  -3.079373 2.548563 2.005909
C  -4.48784 1.127476 0.695159
C  -4.255544 1.829621 1.86986
H  3.024135 -2.027345 1.314829
H  3.587113 -2.503436 -1.636067
H  5.701464 -3.494753 -0.779641
H  5.247153 -3.083642 0.867726
H  5.591991 -1.80989 -0.306658
H  2.072743 -4.290412 -0.814995
H  3.702609 -4.920171 -1.015172
H  3.100292 -4.542833 0.593755
H  0.914139 -2.6824 1.9544
H  1.423111 -1.099913 -1.986097
H  3.947013 2.084305 0.486072
H  -1.467719 -2.940909 1.56665
H  -0.992567 -1.286128 -2.364828
H  0.330819 1.073047 0.477498
H  3.362978 3.618195 -1.175115
H  1.733904 4.481364 -2.817589
H  -0.598181 3.645927 -2.807947
H  -3.445765 -1.588156 1.061022
H  -1.234727 3.1605 1.114629
H  -3.729195 0.588654 -1.243419
H  -2.886563 3.107353 2.912052
H  -5.406071 0.570044 0.566731
H  -4.987312 1.821717 2.666069
totalener: -1560.09332781 hartree
nucrepener: 3467.40452328 hartree
electener: -5027.49785108 hartree
oneelecener: -9025.37718671 hartree
twoeener: 3997.87933562 hartree
kineticenergy: 1553.71938952 hartree
xcener: -146.829469681985 hartree
chargesum: 0.0000000
charge: -0.190428 -0.180063 -0.262727 -0.331221 -0.247258 -0.298070 -0.000464 0.054460 0.071589 -0.074225 -0.276180 -0.282832 0.269643 -0.145365 -0.107082 0.305229 -0.121565 -0.192176 0.221475 0.100455 -0.279992 -0.142185 0.255313 -0.257185 -0.090289 -0.200728 0.356218 0.323995 -0.191357 -0.263236 -0.125102 -0.145662 -0.141825 0.086141 0.044648 0.085135 0.078972 0.100521 0.100984 0.092257 0.077463 0.107574 0.130966 0.125863 0.128863 0.125646 0.154461 0.106234 0.128781 0.129717 0.098975 0.139144 0.139690 0.131897 0.146374 0.128530
qa: -0.1904 -0.1801 -0.2627 -0.3312 -0.2473 -0.2981 -0.0005 0.0545 0.0716 -0.0742 -0.2762 -0.2828 0.2696 -0.1454 -0.1071 0.3052 -0.1216 -0.1922 0.2215 0.1005 -0.2800 -0.1422 0.2553 -0.2572 -0.0903 -0.2007 0.3562 0.3240 -0.1914 -0.2632 -0.1251 -0.1457 -0.1418 0.0861 0.0446 0.0851 0.0790 0.1005 0.1010 0.0923 0.0775 0.1076 0.1310 0.1259 0.1289 0.1256 0.1545 0.1062 0.1288 0.1297 0.0990 0.1391 0.1397 0.1319 0.1464 0.1285
va: 1.0845 1.0981 2.1350 2.1606 2.0811 2.0853 3.1175 3.8011 3.8068 3.5576 3.9338 3.9515 4.2781 4.0540 3.8930 3.8384 3.9342 4.0003 3.8802 3.5829 3.9969 4.0328 3.7424 4.0257 3.9506 4.0889 4.3044 3.7377 3.9460 3.9163 3.9771 3.8805 3.9557 1.0347 1.0271 1.0078 1.0036 1.0152 1.0029 1.0079 1.0045 1.0146 1.0172 1.0161 1.0196 1.0157 0.9955 1.0121 0.9998 1.0104 0.9753 1.0040 1.0220 0.9990 1.0027 0.9994
dispcorr: -0.035734685 hartree
energy: -1560.129062492710
dipole: 25.71616 -25.14274 0.57342 -6.07008 5.89161 -0.17847 -1.91804 1.47303 -0.44501
magnitude: 0.74746 au
magnitude: 1.89989 debye
