program: Orca
programVersion: 5.0.2
elementType: F F O O O O N C C C C C C C C C C C C C C C C C C C C C C C C C C H H H H H H H H H H H H H H H H H H H H H H H
charge: 0
multiplicity: 1
keywords: wb97x-d3
keywords: def2-TZVPP
keywords: def2/J RIJCOSX
keywords: DEFGRID2
keywords: scfconv7
keywords: smallprint printgap noloewdin
keywords: NOSOSCF
formula: C26H23F2NO4
InChI: InChI=1/C26H23F2NO4/c1-17(2)24(18-11-13-21(14-12-18)32-26(27)28)25(30)33-23(16-29)19-7-6-10-22(15-19)31-20-8-4-3-5-9-20/h3-15,17,23-24,26H,1-2H3
56 atoms
F  -4.677999 -1.571815 -1.279896
F  -3.215174 -1.71856 -2.863149
O  2.749176 0.559115 1.015534
O  3.857852 -0.200279 -0.770046
O  -2.732715 -2.378047 -0.787107
O  -1.98201 2.180618 -0.630073
N  2.611175 3.510324 2.514418
C  2.720207 -1.772602 0.66876
C  3.595459 -2.912956 0.11681
C  1.264007 -1.885309 0.260024
C  5.014029 -2.829124 0.674693
C  2.991541 -4.275873 0.438667
C  3.207637 -0.415128 0.213785
C  0.328245 -2.424024 1.138767
C  0.829435 -1.504789 -1.003428
C  2.804505 1.883378 0.481982
C  -0.994455 -2.587589 0.769549
C  -0.496319 -1.65134 -1.387741
C  -1.410275 -2.192553 -0.495194
C  1.684362 2.065734 -0.512902
C  0.372788 2.112774 -0.053223
C  1.961533 2.062709 -1.870801
C  -0.668645 2.126257 -0.967688
C  2.691783 2.782673 1.629946
C  0.909948 2.096241 -2.776362
C  -0.398711 2.11548 -2.333801
C  -3.375669 -1.451093 -1.545735
C  -2.422718 1.9295 0.642178
C  -2.029426 0.804498 1.355359
C  -3.355645 2.810109 1.168192
C  -2.5788 0.569774 2.606321
C  -3.90307 2.557743 2.416573
C  -3.517098 1.439923 3.141302
H  2.761992 -1.800937 1.763596
H  3.63974 -2.805608 -0.970767
H  5.512009 -1.894778 0.4206
H  5.62816 -3.637902 0.27783
H  5.012439 -2.928324 1.76289
H  3.646417 -5.07026 0.079946
H  2.873783 -4.415832 1.516232
H  2.016622 -4.421179 -0.024385
H  0.638561 -2.726588 2.131342
H  1.524206 -1.088896 -1.721978
H  3.770783 2.069582 0.003844
H  -1.71457 -3.00706 1.459549
H  -0.786844 -1.35871 -2.38708
H  0.174969 2.138586 1.011025
H  2.983427 2.014772 -2.220639
H  1.113343 2.096735 -3.838723
H  -1.221598 2.136222 -3.036723
H  -3.042619 -0.425164 -1.355951
H  -1.30006 0.11614 0.948922
H  -3.652542 3.679713 0.596833
H  -2.268707 -0.30636 3.160689
H  -4.634107 3.243082 2.824433
H  -3.944964 1.248122 4.115853
totalener: -1560.09200450 hartree
nucrepener: 3507.34726578 hartree
electener: -5067.43927028 hartree
oneelecener: -9104.95627463 hartree
twoeener: 4037.51700435 hartree
kineticenergy: 1553.71426284 hartree
xcener: -146.829770529314 hartree
chargesum: 0.0000000
charge: -0.177088 -0.194938 -0.249576 -0.348541 -0.254785 -0.303309 0.003240 0.063427 0.073975 0.005539 -0.278364 -0.289137 0.279147 -0.113985 -0.180738 0.327817 -0.217165 -0.146159 0.189301 0.027518 -0.211942 -0.179429 0.291314 -0.280179 -0.056804 -0.260185 0.421281 0.275140 -0.175894 -0.194243 -0.123470 -0.096164 -0.127567 0.091389 0.045875 0.102273 0.085562 0.079166 0.093879 0.075549 0.100927 0.110908 0.137922 0.124587 0.128201 0.134729 0.141745 0.119804 0.131750 0.128865 0.054629 0.109262 0.127533 0.122118 0.127861 0.127432
qa: -0.1771 -0.1949 -0.2496 -0.3485 -0.2548 -0.3033 0.0032 0.0634 0.0740 0.0055 -0.2784 -0.2891 0.2791 -0.1140 -0.1807 0.3278 -0.2172 -0.1462 0.1893 0.0275 -0.2119 -0.1794 0.2913 -0.2802 -0.0568 -0.2602 0.4213 0.2751 -0.1759 -0.1942 -0.1235 -0.0962 -0.1276 0.0914 0.0459 0.1023 0.0856 0.0792 0.0939 0.0755 0.1009 0.1109 0.1379 0.1246 0.1282 0.1347 0.1417 0.1198 0.1317 0.1289 0.0546 0.1093 0.1275 0.1221 0.1279 0.1274
va: 1.1134 1.0769 2.1608 2.1364 2.0824 2.0824 3.1180 3.7993 3.7902 3.5550 3.9360 3.9547 4.2816 3.9058 3.9681 3.8313 4.0095 3.8417 3.8896 3.6539 3.9863 3.9781 3.7847 4.0497 3.9173 4.0065 4.2875 3.7070 3.8717 4.0525 3.9939 3.9477 3.9730 1.0305 1.0293 1.0144 1.0074 1.0036 1.0090 1.0042 1.0009 1.0092 1.0162 1.0158 1.0134 1.0232 1.0081 1.0218 0.9973 1.0149 1.0036 1.0059 1.0131 1.0032 0.9989 1.0003
dispcorr: -0.037198770 hartree
energy: -1560.129203268596
dipole: 24.99260 -24.69089 0.30172 -12.55093 11.92894 -0.62199 9.87515 -9.99892 -0.12377
magnitude: 0.70230 au
magnitude: 1.78511 debye
