program: Orca
programVersion: 5.0.2
elementType: F F O O O O N C C C C C C C C C C C C C C C C C C C C C C C C C C H H H H H H H H H H H H H H H H H H H H H H H
charge: 0
multiplicity: 1
keywords: wb97x-d3
keywords: def2-TZVPP
keywords: def2/J RIJCOSX
keywords: DEFGRID2
keywords: scfconv7
keywords: smallprint printgap noloewdin
keywords: NOSOSCF
formula: C26H23F2NO4
InChI: InChI=1/C26H23F2NO4/c1-17(2)24(18-11-13-21(14-12-18)32-26(27)28)25(30)33-23(16-29)19-7-6-10-22(15-19)31-20-8-4-3-5-9-20/h3-15,17,23-24,26H,1-2H3
56 atoms
F  -2.244413 -1.418106 -3.170251
F  -3.031638 -0.693478 -1.295249
O  2.946488 0.345383 0.752152
O  3.971517 -0.524107 -1.045436
O  -2.26342 -2.78973 -1.401944
O  -1.645966 3.210614 1.075637
N  3.720728 3.365785 1.904436
C  2.993401 -1.994237 0.600444
C  3.988836 -3.120203 0.293018
C  1.591271 -2.217736 0.063566
C  5.352209 -2.816796 0.907265
C  3.460543 -4.45453 0.808041
C  3.401514 -0.666963 -0.001203
C  0.482501 -2.000983 0.87152
C  1.385286 -2.586605 -1.262778
C  2.858406 1.637368 0.148134
C  -0.803477 -2.160859 0.37926
C  0.106456 -2.757517 -1.765096
C  -0.98387 -2.545229 -0.93735
C  1.427221 1.86497 -0.268322
C  0.5146 2.459174 0.589934
C  1.006989 1.355352 -1.49197
C  -0.817325 2.560427 0.214963
C  3.339382 2.599829 1.138575
C  -0.328395 1.447237 -1.847259
C  -1.245991 2.055205 -1.00576
C  -2.909877 -1.801568 -2.057361
C  -2.93212 2.789356 1.253739
C  -3.896966 3.76977 1.435642
C  -3.273939 1.444015 1.312352
C  -5.209931 3.399819 1.680986
C  -4.593608 1.08933 1.545823
C  -5.5665 2.060395 1.731672
H  2.925705 -1.878214 1.686862
H  4.116037 -3.189012 -0.791038
H  5.790687 -1.899353 0.515395
H  6.054776 -3.623665 0.696748
H  5.282071 -2.721394 1.993226
H  4.174377 -5.252641 0.602387
H  3.305648 -4.424767 1.889032
H  2.513703 -4.731318 0.345446
H  0.62082 -1.699905 1.902184
H  2.230816 -2.742681 -1.920327
H  3.520233 1.695292 -0.721047
H  -1.659734 -2.008676 1.022581
H  -0.039239 -3.07063 -2.789786
H  0.821979 2.858255 1.548994
H  1.714879 0.88159 -2.159653
H  -0.662879 1.04388 -2.792946
H  -2.283889 2.133329 -1.300353
H  -3.899073 -2.164105 -2.33429
H  -3.612053 4.812723 1.391101
H  -2.520072 0.679576 1.176438
H  -5.958969 4.166982 1.826416
H  -4.859328 0.041263 1.588311
H  -6.593239 1.775741 1.9173
totalener: -1560.09175496 hartree
nucrepener: 3432.23658455 hartree
electener: -4992.32833951 hartree
oneelecener: -8955.49224665 hartree
twoeener: 3963.16390714 hartree
kineticenergy: 1553.72383173 hartree
xcener: -146.824797767977 hartree
chargesum: -0.0000000
charge: -0.203416 -0.194309 -0.252074 -0.349814 -0.314529 -0.295825 -0.001426 0.088399 0.039223 0.009352 -0.279119 -0.273782 0.288917 -0.149877 -0.191194 0.302881 -0.157915 -0.129686 0.229082 0.038872 -0.207353 -0.175130 0.235272 -0.260828 -0.111703 -0.161686 0.403906 0.241017 -0.202572 -0.141862 -0.097139 -0.126810 -0.135654 0.087109 0.047743 0.102659 0.084912 0.083359 0.089566 0.080297 0.099878 0.110010 0.128302 0.131689 0.124782 0.125146 0.121946 0.129749 0.129936 0.134180 0.110941 0.126475 0.118069 0.125675 0.119789 0.124571
qa: -0.2034 -0.1943 -0.2521 -0.3498 -0.3145 -0.2958 -0.0014 0.0884 0.0392 0.0094 -0.2791 -0.2738 0.2889 -0.1499 -0.1912 0.3029 -0.1579 -0.1297 0.2291 0.0389 -0.2074 -0.1751 0.2353 -0.2608 -0.1117 -0.1617 0.4039 0.2410 -0.2026 -0.1419 -0.0971 -0.1268 -0.1357 0.0871 0.0477 0.1027 0.0849 0.0834 0.0896 0.0803 0.0999 0.1100 0.1283 0.1317 0.1248 0.1251 0.1219 0.1297 0.1299 0.1342 0.1109 0.1265 0.1181 0.1257 0.1198 0.1246
va: 1.0827 1.0907 2.1306 2.1432 2.0976 2.1194 3.1150 3.7064 3.8342 3.5493 3.9360 3.9387 4.2910 4.0024 3.9802 3.8143 4.0257 4.0391 3.8084 3.6925 4.1040 3.9367 3.8910 4.0453 3.9042 3.9265 4.2788 3.8298 4.0273 3.9236 3.9406 3.9643 3.9573 1.0354 1.0263 1.0128 1.0064 1.0046 1.0076 1.0053 1.0043 1.0145 1.0178 1.0234 1.0041 1.0110 1.0328 1.0163 1.0127 1.0078 0.9785 1.0141 1.0039 0.9990 1.0036 1.0003
dispcorr: -0.034405786 hartree
energy: -1560.126160745045
dipole: 15.11563 -16.44227 -1.32664 -16.51108 14.84288 -1.66820 9.57073 -10.18612 -0.61540
magnitude: 2.21847 au
magnitude: 5.63889 debye
