program: Orca
programVersion: 5.0.2
elementType: F F O O O O N C C C C C C C C C C C C C C C C C C C C C C C C C C H H H H H H H H H H H H H H H H H H H H H H H
charge: 0
multiplicity: 1
keywords: wb97x-d3
keywords: def2-TZVPP
keywords: def2/J RIJCOSX
keywords: DEFGRID2
keywords: scfconv7
keywords: smallprint printgap noloewdin
keywords: NOSOSCF
formula: C26H23F2NO4
InChI: InChI=1/C26H23F2NO4/c1-17(2)24(18-11-13-21(14-12-18)32-26(27)28)25(30)33-23(16-29)19-7-6-10-22(15-19)31-20-8-4-3-5-9-20/h3-15,17,23-24,26H,1-2H3
56 atoms
F  -4.217557 -2.780336 -0.150658
F  -4.562757 -1.302813 -1.691658
O  2.791975 0.610524 0.963729
O  3.889284 -0.265965 -0.774912
O  -2.572168 -2.140587 -1.509908
O  -1.818295 2.650579 -0.582357
N  2.925547 3.622895 2.366171
C  2.649062 -1.731056 0.688416
C  3.559633 -2.914591 0.314649
C  1.247796 -1.844275 0.114941
C  4.925554 -2.783014 0.983248
C  2.915977 -4.240931 0.70316
C  3.211553 -0.412711 0.203624
C  0.182783 -2.236367 0.916499
C  0.993694 -1.591994 -1.23193
C  2.939284 1.913478 0.393859
C  -1.10101 -2.375274 0.405202
C  -0.285816 -1.688437 -1.747869
C  -1.337658 -2.071749 -0.928374
C  1.811685 2.158369 -0.578115
C  0.525721 2.35455 -0.090696
C  2.044123 2.077877 -1.943506
C  -0.536664 2.43259 -0.977967
C  2.92694 2.854506 1.512964
C  0.976206 2.185783 -2.822218
C  -0.313228 2.346151 -2.347063
C  -3.661778 -1.733741 -0.802321
C  -2.333645 2.097997 0.552356
C  -1.869873 0.913066 1.109708
C  -3.419428 2.758481 1.113823
C  -2.496594 0.403932 2.238878
C  -4.041214 2.229798 2.232099
C  -3.581922 1.052191 2.805535
H  2.563039 -1.688823 1.779656
H  3.699383 -2.903031 -0.770223
H  5.561229 -3.62967 0.722738
H  4.829486 -2.773279 2.071631
H  5.456068 -1.880568 0.682502
H  1.971049 -4.412092 0.189247
H  3.580254 -5.068843 0.453932
H  2.726347 -4.290304 1.778397
H  0.35369 -2.455926 1.963483
H  1.796572 -1.296541 -1.894512
H  3.904684 2.007564 -0.111782
H  -1.897371 -2.721529 1.050616
H  -0.475993 -1.459354 -2.787724
H  0.356131 2.445175 0.975496
H  3.045982 1.9185 -2.318051
H  1.148649 2.129188 -3.888513
H  -1.151594 2.416403 -3.027432
H  -3.441254 -0.944549 -0.076823
H  -1.031756 0.380519 0.680621
H  -3.77289 3.677141 0.664651
H  -2.124837 -0.51483 2.673908
H  -4.888434 2.74779 2.66126
H  -4.064866 0.646251 3.683686
totalener: -1560.09233844 hartree
nucrepener: 3494.29116322 hartree
electener: -5054.38350166 hartree
oneelecener: -9078.73887225 hartree
twoeener: 4024.35537059 hartree
kineticenergy: 1553.70898679 hartree
xcener: -146.829857895008 hartree
chargesum: 0.0000000
charge: -0.194811 -0.181079 -0.250384 -0.354713 -0.257276 -0.291789 0.003514 0.091420 0.064529 -0.035547 -0.277379 -0.287829 0.280030 -0.105020 -0.151440 0.328620 -0.256172 -0.174088 0.241168 0.035218 -0.225221 -0.168423 0.287525 -0.276443 -0.077470 -0.229975 0.425712 0.320453 -0.226183 -0.206771 -0.151517 -0.089679 -0.130665 0.089483 0.047512 0.085218 0.081461 0.101814 0.100851 0.094290 0.075886 0.112021 0.132618 0.124909 0.139139 0.124555 0.141946 0.124140 0.131681 0.129661 0.056822 0.119732 0.126546 0.126015 0.127620 0.127762
qa: -0.1948 -0.1811 -0.2504 -0.3547 -0.2573 -0.2918 0.0035 0.0914 0.0645 -0.0355 -0.2774 -0.2878 0.2800 -0.1050 -0.1514 0.3286 -0.2562 -0.1741 0.2412 0.0352 -0.2252 -0.1684 0.2875 -0.2764 -0.0775 -0.2300 0.4257 0.3205 -0.2262 -0.2068 -0.1515 -0.0897 -0.1307 0.0895 0.0475 0.0852 0.0815 0.1018 0.1009 0.0943 0.0759 0.1120 0.1326 0.1249 0.1391 0.1246 0.1419 0.1241 0.1317 0.1297 0.0568 0.1197 0.1265 0.1260 0.1276 0.1278
va: 1.0801 1.1070 2.1614 2.1312 2.0923 2.1391 3.1173 3.7723 3.8033 3.6010 3.9324 3.9513 4.2815 3.8695 3.9323 3.8247 3.9128 4.0151 3.8487 3.6163 3.9919 3.9649 3.7991 4.0486 3.9177 4.0280 4.2797 3.7781 3.7980 4.0213 3.9097 3.9507 3.9859 1.0341 1.0285 1.0075 1.0038 1.0139 1.0015 1.0085 1.0047 1.0134 1.0207 1.0177 1.0182 1.0164 1.0087 1.0198 0.9977 1.0128 1.0008 1.0137 1.0152 1.0030 0.9986 1.0005
dispcorr: -0.036778744 hartree
energy: -1560.129117178600
dipole: 25.19185 -24.90562 0.28623 -12.53960 11.82009 -0.71951 8.02211 -8.21216 -0.19005
magnitude: 0.79733 au
magnitude: 2.02666 debye
