program: Orca
programVersion: 5.0.2
elementType: F F O O O O N C C C C C C C C C C C C C C C C C C C C C C C C C C H H H H H H H H H H H H H H H H H H H H H H H
charge: 0
multiplicity: 1
keywords: wb97x-d3
keywords: def2-TZVPP
keywords: def2/J RIJCOSX
keywords: DEFGRID2
keywords: scfconv7
keywords: smallprint printgap noloewdin
keywords: NOSOSCF
formula: C26H23F2NO4
InChI: InChI=1/C26H23F2NO4/c1-17(2)24(18-11-13-21(14-12-18)32-26(27)28)25(30)33-23(16-29)19-7-6-10-22(15-19)31-20-8-4-3-5-9-20/h3-15,17,23-24,26H,1-2H3
56 atoms
F  -3.697523 -2.898483 2.577892
F  -4.88305 -1.614443 1.311188
O  2.868363 0.490336 0.339052
O  2.933414 -0.04285 -1.83975
O  -3.004459 -2.355688 0.527668
O  -1.851197 2.330533 0.56356
N  5.238498 2.673517 1.155738
C  2.588685 -1.779588 -0.193049
C  3.160254 -2.849467 -1.138193
C  1.094748 -1.90543 0.024073
C  4.676128 -2.721184 -1.257355
C  2.787432 -4.243555 -0.645933
C  2.837843 -0.375138 -0.693437
C  0.584252 -2.215627 1.275632
C  0.200856 -1.732607 -1.031419
C  3.009335 1.870945 0.05259
C  -0.778949 -2.377402 1.480902
C  -1.161515 -1.867091 -0.840109
C  -1.649274 -2.197631 0.416587
C  1.795082 2.648099 0.518266
C  0.533888 2.087044 0.356553
C  1.924985 3.937718 1.01623
C  -0.591743 2.837926 0.667196
C  4.252316 2.31714 0.68751
C  0.792138 4.666231 1.344366
C  -0.469258 4.128092 1.162629
C  -3.623327 -1.917806 1.650846
C  -2.289146 1.711467 -0.569021
C  -1.678464 1.833135 -1.811198
C  -3.451262 0.962408 -0.432187
C  -2.234331 1.184572 -2.905122
C  -3.995943 0.324298 -1.532734
C  -3.388536 0.427513 -2.776626
H  3.079824 -1.882113 0.780397
H  2.721498 -2.702237 -2.129445
H  5.156865 -2.832293 -0.282497
H  4.984887 -1.765492 -1.678646
H  5.075189 -3.501559 -1.905795
H  3.179752 -4.426096 0.357451
H  1.709719 -4.398492 -0.613846
H  3.210412 -5.003257 -1.303635
H  1.258653 -2.354324 2.111251
H  0.565977 -1.476015 -2.018306
H  3.12818 2.013733 -1.027498
H  -1.137154 -2.667001 2.459658
H  -1.851308 -1.709215 -1.65802
H  0.41154 1.072306 -0.001871
H  2.90267 4.379328 1.157683
H  0.895873 5.667306 1.740172
H  -1.358362 4.693004 1.408675
H  -3.137161 -1.046217 2.102925
H  -0.786362 2.430519 -1.94074
H  -3.934886 0.905008 0.533836
H  -1.756306 1.284378 -3.870802
H  -4.897626 -0.260276 -1.411738
H  -3.814624 -0.069952 -3.637235
totalener: -1560.09326434 hartree
nucrepener: 3451.92612289 hartree
electener: -5012.01938722 hartree
oneelecener: -8994.02676613 hartree
twoeener: 3982.00737891 hartree
kineticenergy: 1553.70524168 hartree
xcener: -146.828834532859 hartree
chargesum: 0.0000000
charge: -0.190228 -0.182512 -0.262234 -0.343859 -0.247508 -0.296973 -0.001117 0.079054 0.057090 -0.121268 -0.274582 -0.284293 0.287673 -0.106323 -0.069085 0.324354 -0.145885 -0.225415 0.207404 -0.017197 -0.167231 -0.167088 0.243279 -0.255203 -0.089656 -0.188718 0.361043 0.355668 -0.221135 -0.281561 -0.097450 -0.056414 -0.205133 0.086101 0.046811 0.082834 0.103452 0.084784 0.078636 0.101063 0.092565 0.110483 0.128962 0.131440 0.138023 0.148463 0.109761 0.128497 0.131621 0.128546 0.091873 0.134100 0.135345 0.130311 0.130321 0.128511
qa: -0.1902 -0.1825 -0.2622 -0.3439 -0.2475 -0.2970 -0.0011 0.0791 0.0571 -0.1213 -0.2746 -0.2843 0.2877 -0.1063 -0.0691 0.3244 -0.1459 -0.2254 0.2074 -0.0172 -0.1672 -0.1671 0.2433 -0.2552 -0.0897 -0.1887 0.3610 0.3557 -0.2211 -0.2816 -0.0975 -0.0564 -0.2051 0.0861 0.0468 0.0828 0.1035 0.0848 0.0786 0.1011 0.0926 0.1105 0.1290 0.1314 0.1380 0.1485 0.1098 0.1285 0.1316 0.1285 0.0919 0.1341 0.1353 0.1303 0.1303 0.1285
va: 1.0853 1.0941 2.1359 2.1526 2.0795 2.1170 3.1114 3.7750 3.8136 3.6323 3.9289 3.9508 4.2687 4.0038 3.8742 3.8165 3.9445 4.0222 3.9092 3.8171 3.9372 3.9925 3.8292 4.0245 3.9682 4.0439 4.3024 3.6988 3.9420 3.9618 3.8961 3.8715 3.9525 1.0378 1.0259 1.0038 1.0143 1.0071 1.0050 1.0025 1.0077 1.0123 1.0233 1.0251 1.0170 1.0116 1.0172 1.0211 0.9998 1.0120 0.9811 1.0030 1.0152 0.9983 1.0085 1.0010
dispcorr: -0.035612079 hartree
energy: -1560.128876414386
dipole: 22.61787 -23.02727 -0.40939 -8.68217 8.58847 -0.09370 -14.22079 13.86769 -0.35311
magnitude: 0.54870 au
magnitude: 1.39467 debye
