program: Orca
programVersion: 5.0.2
elementType: F F O O O O N C C C C C C C C C C C C C C C C C C C C C C C C C C H H H H H H H H H H H H H H H H H H H H H H H
charge: 0
multiplicity: 1
keywords: wb97x-d3
keywords: def2-TZVPP
keywords: def2/J RIJCOSX
keywords: DEFGRID2
keywords: scfconv7
keywords: smallprint printgap noloewdin
keywords: NOSOSCF
formula: C26H23F2NO4
InChI: InChI=1/C26H23F2NO4/c1-17(2)24(18-11-13-21(14-12-18)32-26(27)28)25(30)33-23(16-29)19-7-6-10-22(15-19)31-20-8-4-3-5-9-20/h3-15,17,23-24,26H,1-2H3
56 atoms
F  -3.00782 -1.90359 2.99762
F  -4.07561 -0.694019 1.559166
O  3.347432 0.319992 0.444488
O  3.394504 -0.173926 -1.743564
O  -2.381918 -1.850156 0.85762
O  -1.504045 1.186174 -1.441937
N  4.478256 3.158936 1.742259
C  3.199538 -1.953428 -0.117981
C  3.744677 -2.991976 -1.103876
C  1.71078 -2.04086 0.160827
C  5.25331 -2.837352 -1.271169
C  3.404812 -4.400796 -0.630418
C  3.363232 -0.527367 -0.599302
C  0.784968 -2.057414 -0.879936
C  1.234819 -1.98913 1.46172
C  2.99594 1.67797 0.18494
C  -0.572644 -2.003461 -0.627226
C  -0.124318 -1.947094 1.735098
C  -1.025956 -1.929782 0.681859
C  1.514864 1.852215 0.426677
C  0.646817 1.520852 -0.604262
C  1.013831 2.256822 1.657682
C  -0.726068 1.57982 -0.40366
C  3.82471 2.500491 1.065384
C  -0.357167 2.3343 1.839411
C  -1.236022 1.996296 0.821208
C  -2.856654 -1.124776 1.903328
C  -2.799593 1.628857 -1.523202
C  -3.820281 0.694382 -1.484156
C  -3.074381 2.979586 -1.688978
C  -5.133855 1.118745 -1.624888
C  -4.390925 3.391568 -1.81893
C  -5.423491 2.464318 -1.788375
H  3.730096 -2.064166 0.833747
H  3.277876 -2.829447 -2.079541
H  5.6413 -3.589201 -1.958922
H  5.769471 -2.972094 -0.317634
H  5.530213 -1.862273 -1.670219
H  3.803489 -5.143077 -1.32246
H  3.840614 -4.601907 0.351095
H  2.330208 -4.5638 -0.554067
H  1.122131 -2.082535 -1.908539
H  1.933674 -1.975837 2.288457
H  3.244164 1.944428 -0.84684
H  -1.282528 -1.99182 -1.443061
H  -0.455931 -1.94047 2.764423
H  1.023694 1.209813 -1.570487
H  1.681555 2.52328 2.466396
H  -0.753004 2.664071 2.790883
H  -2.304709 2.070656 0.97838
H  -2.217145 -0.274855 2.163084
H  -3.588394 -0.353099 -1.348176
H  -2.26583 3.698854 -1.723294
H  -5.933045 0.390363 -1.596288
H  -4.609186 4.442897 -1.950996
H  -6.449205 2.79053 -1.893876
totalener: -1560.09152206 hartree
nucrepener: 3476.59114346 hartree
electener: -5036.68266552 hartree
oneelecener: -9043.58736280 hartree
twoeener: 4006.90469728 hartree
kineticenergy: 1553.72335992 hartree
xcener: -146.829120208680 hartree
chargesum: 0.0000000
charge: -0.191620 -0.179285 -0.251474 -0.346192 -0.262870 -0.290686 -0.001573 0.079172 0.047077 -0.015999 -0.279264 -0.274296 0.284308 -0.164990 -0.150498 0.300910 -0.157769 -0.137871 0.203786 0.050783 -0.222582 -0.158937 0.260887 -0.261937 -0.107331 -0.267417 0.401673 0.231298 -0.190703 -0.141911 -0.111823 -0.125339 -0.123080 0.088903 0.045366 0.085102 0.081457 0.103144 0.089507 0.079771 0.100617 0.128614 0.107736 0.131551 0.129009 0.131594 0.130053 0.123482 0.135768 0.157417 0.065840 0.122459 0.131804 0.129346 0.128702 0.128314
qa: -0.1916 -0.1793 -0.2515 -0.3462 -0.2629 -0.2907 -0.0016 0.0792 0.0471 -0.0160 -0.2793 -0.2743 0.2843 -0.1650 -0.1505 0.3009 -0.1578 -0.1379 0.2038 0.0508 -0.2226 -0.1589 0.2609 -0.2619 -0.1073 -0.2674 0.4017 0.2313 -0.1907 -0.1419 -0.1118 -0.1253 -0.1231 0.0889 0.0454 0.0851 0.0815 0.1031 0.0895 0.0798 0.1006 0.1286 0.1077 0.1316 0.1290 0.1316 0.1301 0.1235 0.1358 0.1574 0.0658 0.1225 0.1318 0.1293 0.1287 0.1283
va: 1.0871 1.0983 2.1277 2.1451 2.0644 2.0719 3.1173 3.7129 3.8310 3.5779 3.9359 3.9407 4.2880 3.9849 4.0541 3.8159 3.9718 3.8939 3.8953 3.6808 3.9901 4.0140 3.7402 4.0362 3.9535 3.9025 4.2781 3.7888 3.9862 3.9713 3.9849 3.9513 3.9465 1.0336 1.0260 1.0067 1.0043 1.0133 1.0076 1.0050 1.0048 1.0169 1.0153 1.0213 1.0073 1.0183 1.0305 1.0187 0.9994 0.9980 0.9994 1.0253 1.0046 1.0004 0.9998 0.9993
dispcorr: -0.036714402 hartree
energy: -1560.128236464855
dipole: 18.85433 -19.61788 -0.76355 -11.12265 10.70287 -0.41978 -12.30554 12.02615 -0.27940
magnitude: 0.91504 au
magnitude: 2.32584 debye
