program: Orca
programVersion: 5.0.2
elementType: F F O O O O N C C C C C C C C C C C C C C C C C C C C C C C C C C H H H H H H H H H H H H H H H H H H H H H H H
charge: 0
multiplicity: 1
keywords: wb97x-d3
keywords: def2-TZVPP
keywords: def2/J RIJCOSX
keywords: DEFGRID2
keywords: scfconv7
keywords: smallprint printgap noloewdin
keywords: NOSOSCF
formula: C26H23F2NO4
InChI: InChI=1/C26H23F2NO4/c1-17(2)24(18-11-13-21(14-12-18)32-26(27)28)25(30)33-23(16-29)19-7-6-10-22(15-19)31-20-8-4-3-5-9-20/h3-15,17,23-24,26H,1-2H3
56 atoms
F  -4.274829 -2.272974 1.481394
F  -3.60985 -2.222022 -0.574406
O  3.182313 0.304287 0.734455
O  3.614233 0.057984 -1.443689
O  -2.24087 -2.872101 1.067757
O  -1.723857 1.282402 -0.125469
N  3.083837 2.765378 2.932057
C  3.230762 -1.901426 -0.059679
C  3.781052 -2.814116 -1.167522
C  1.762195 -2.124017 0.233759
C  5.291489 -2.655074 -1.316404
C  3.439282 -4.272371 -0.8772
C  3.390585 -0.429376 -0.373915
C  1.348174 -2.630651 1.459423
C  0.794598 -1.832441 -0.720228
C  3.065655 1.704919 0.544016
C  0.008927 -2.85676 1.724406
C  -0.551116 -2.057839 -0.474268
C  -0.940656 -2.57564 0.753507
C  1.80325 2.084808 -0.195192
C  0.58654 1.534134 0.184013
C  1.870635 2.990842 -1.24175
C  -0.564783 1.88944 -0.503697
C  3.076317 2.283363 1.889722
C  0.711585 3.346902 -1.911604
C  -0.508763 2.799128 -1.55398
C  -3.219665 -2.004004 0.708803
C  -2.910894 1.948937 -0.284655
C  -3.922825 1.319891 -0.991397
C  -3.115716 3.193578 0.29653
C  -5.158177 1.941346 -1.10986
C  -4.349819 3.808064 0.160103
C  -5.37451 3.186208 -0.540522
H  3.789222 -2.10505 0.861721
H  3.3082 -2.530463 -2.112633
H  5.805022 -2.925126 -0.390373
H  5.582887 -1.641165 -1.583885
H  5.667634 -3.315926 -2.098109
H  3.858893 -4.59369 0.079395
H  2.365105 -4.44937 -0.843802
H  3.856558 -4.920047 -1.648732
H  2.082085 -2.852672 2.224081
H  1.083912 -1.424454 -1.681348
H  3.934112 2.095618 0.002439
H  -0.306069 -3.253321 2.680503
H  -1.271945 -1.845499 -1.250404
H  0.520664 0.826043 1.001377
H  2.823611 3.404932 -1.543917
H  0.758063 4.046923 -2.734682
H  -1.405404 3.073771 -2.093717
H  -2.929796 -0.953585 0.80588
H  -3.748102 0.34929 -1.436633
H  -2.32107 3.673261 0.853826
H  -5.950684 1.447684 -1.656099
H  -4.51389 4.775988 0.614742
H  -6.33753 3.668795 -0.63654
totalener: -1560.09284292 hartree
nucrepener: 3412.81193892 hartree
electener: -4972.90478183 hartree
oneelecener: -8916.31139085 hartree
twoeener: 3943.40660902 hartree
kineticenergy: 1553.71857462 hartree
xcener: -146.825743284373 hartree
chargesum: 0.0000000
charge: -0.178492 -0.199760 -0.257252 -0.331599 -0.261115 -0.308467 0.001215 0.045511 0.071408 -0.056543 -0.277587 -0.282769 0.274218 -0.099276 -0.121652 0.303655 -0.175634 -0.191960 0.219073 0.091999 -0.283625 -0.128597 0.230422 -0.260778 -0.106855 -0.162480 0.402858 0.227986 -0.217120 -0.155537 -0.101764 -0.112395 -0.130792 0.086204 0.043924 0.078520 0.102445 0.084595 0.077886 0.100941 0.091772 0.107848 0.128295 0.123263 0.129483 0.134412 0.129776 0.104983 0.129667 0.135674 0.073651 0.140548 0.140087 0.131082 0.130396 0.128255
qa: -0.1785 -0.1998 -0.2573 -0.3316 -0.2611 -0.3085 0.0012 0.0455 0.0714 -0.0565 -0.2776 -0.2828 0.2742 -0.0993 -0.1217 0.3037 -0.1756 -0.1920 0.2191 0.0920 -0.2836 -0.1286 0.2304 -0.2608 -0.1069 -0.1625 0.4029 0.2280 -0.2171 -0.1555 -0.1018 -0.1124 -0.1308 0.0862 0.0439 0.0785 0.1024 0.0846 0.0779 0.1009 0.0918 0.1078 0.1283 0.1233 0.1295 0.1344 0.1298 0.1050 0.1297 0.1357 0.0737 0.1405 0.1401 0.1311 0.1304 0.1283
va: 1.1125 1.0600 2.1388 2.1631 2.0899 2.0600 3.1202 3.8020 3.8107 3.5447 3.9319 3.9499 4.2769 3.9824 3.9197 3.8446 4.0622 3.9424 3.8839 3.5994 4.0928 4.0122 3.8231 4.0334 3.9817 3.9641 4.2866 3.7317 4.0044 3.9896 3.9612 3.9487 3.9572 1.0338 1.0257 1.0036 1.0164 1.0076 1.0045 1.0032 1.0080 1.0115 1.0201 1.0145 1.0115 1.0199 1.0170 1.0136 1.0010 1.0053 0.9956 1.0168 1.0016 0.9995 0.9990 0.9995
dispcorr: -0.034033805 hartree
energy: -1560.126876721072
dipole: 23.07128 -22.97892 0.09236 -4.47313 4.68508 0.21194 -11.96635 10.84083 -1.12552
magnitude: 1.14901 au
magnitude: 2.92056 debye
