program: Orca
programVersion: 5.0.2
elementType: F F O O O O N C C C C C C C C C C C C C C C C C C C C C C C C C C H H H H H H H H H H H H H H H H H H H H H H H
charge: 0
multiplicity: 1
keywords: wb97x-d3
keywords: def2-TZVPP
keywords: def2/J RIJCOSX
keywords: DEFGRID2
keywords: scfconv7
keywords: smallprint printgap noloewdin
keywords: NOSOSCF
formula: C26H23F2NO4
InChI: InChI=1/C26H23F2NO4/c1-17(2)24(18-11-13-21(14-12-18)32-26(27)28)25(30)33-23(16-29)19-7-6-10-22(15-19)31-20-8-4-3-5-9-20/h3-15,17,23-24,26H,1-2H3
56 atoms
F  -3.775153 -2.96726 0.296806
F  -2.828924 -3.893209 -1.40725
O  2.783677 0.541058 1.066522
O  3.872712 -0.138088 -0.767072
O  -2.669639 -1.677943 -1.16407
O  -1.933974 1.663816 -0.818442
N  2.331944 3.399389 2.654003
C  2.722066 -1.758412 0.616377
C  3.569798 -2.911931 0.066035
C  1.278572 -1.762799 0.151427
C  4.981328 -2.872087 0.644572
C  2.908706 -4.25078 0.376762
C  3.234479 -0.395092 0.212421
C  0.239049 -1.711663 1.069708
C  0.968734 -1.753695 -1.205188
C  2.770667 1.876642 0.577177
C  -1.084957 -1.685831 0.659153
C  -0.348067 -1.745081 -1.629826
C  -1.369487 -1.721515 -0.69553
C  1.690063 2.047038 -0.463651
C  0.36936 1.791046 -0.114624
C  2.024367 2.393113 -1.762987
C  -0.624463 1.916188 -1.074077
C  2.525784 2.719858 1.748708
C  1.023651 2.498667 -2.717573
C  -0.29745 2.26845 -2.378631
C  -3.451476 -2.770758 -1.002988
C  -2.492629 1.987968 0.385616
C  -2.165887 3.149249 1.075748
C  -3.469252 1.131185 0.873575
C  -2.816448 3.436605 2.266122
C  -4.117676 1.437475 2.059361
C  -3.791961 2.586355 2.764831
H  2.724247 -1.817524 1.710258
H  3.642555 -2.803879 -1.020014
H  5.508971 -1.952599 0.394527
H  5.576189 -3.700311 0.258366
H  4.961126 -2.967025 1.732821
H  3.519044 -5.073176 0.002411
H  2.793961 -4.39292 1.453971
H  1.921486 -4.339841 -0.075181
H  0.460574 -1.688807 2.129386
H  1.759405 -1.754048 -1.944841
H  3.743798 2.15089 0.157759
H  -1.875458 -1.622283 1.392906
H  -0.585807 -1.744513 -2.68501
H  0.117662 1.497993 0.897537
H  3.057811 2.564887 -2.032337
H  1.275164 2.766583 -3.734828
H  -1.084058 2.357984 -3.116211
H  -4.365463 -2.623277 -1.577946
H  -1.414466 3.82854 0.694404
H  -3.719674 0.237644 0.318896
H  -2.556548 4.33897 2.803317
H  -4.880167 0.767319 2.434169
H  -4.295874 2.819628 3.692797
totalener: -1560.09116383 hartree
nucrepener: 3502.95715608 hartree
electener: -5063.04831990 hartree
oneelecener: -9097.31614945 hartree
twoeener: 4034.26782955 hartree
kineticenergy: 1553.73921717 hartree
xcener: -146.830281330020 hartree
chargesum: -0.0000000
charge: -0.201926 -0.190251 -0.261398 -0.339879 -0.329716 -0.295584 -0.001088 0.068051 0.054945 0.004869 -0.278482 -0.275784 0.277977 -0.169271 -0.152379 0.335419 -0.115943 -0.157743 0.239403 0.067526 -0.240183 -0.128002 0.245381 -0.274216 -0.081848 -0.228274 0.414420 0.275401 -0.172400 -0.251575 -0.117702 -0.097314 -0.137915 0.087855 0.044881 0.101492 0.085337 0.080543 0.089320 0.078458 0.102208 0.111049 0.121981 0.122640 0.123011 0.119904 0.130002 0.110740 0.127178 0.128142 0.096427 0.132729 0.140789 0.129802 0.125471 0.125523
qa: -0.2019 -0.1903 -0.2614 -0.3399 -0.3297 -0.2956 -0.0011 0.0681 0.0549 0.0049 -0.2785 -0.2758 0.2780 -0.1693 -0.1524 0.3354 -0.1159 -0.1577 0.2394 0.0675 -0.2402 -0.1280 0.2454 -0.2742 -0.0818 -0.2283 0.4144 0.2754 -0.1724 -0.2516 -0.1177 -0.0973 -0.1379 0.0879 0.0449 0.1015 0.0853 0.0805 0.0893 0.0785 0.1022 0.1110 0.1220 0.1226 0.1230 0.1199 0.1300 0.1107 0.1272 0.1281 0.0964 0.1327 0.1408 0.1298 0.1255 0.1255
va: 1.0779 1.0976 2.1492 2.1563 2.0313 2.0790 3.1201 3.7388 3.8289 3.5085 3.9328 3.9436 4.3196 3.9962 3.9584 3.8395 4.0040 4.0941 3.6796 3.6136 3.9769 3.9968 3.7268 4.0423 3.9473 4.0696 4.2815 3.7928 3.9466 3.9739 3.9606 3.9429 3.9631 1.0357 1.0262 1.0143 1.0070 1.0043 1.0074 1.0052 1.0045 1.0123 1.0189 1.0160 1.0178 1.0118 1.0162 1.0174 0.9991 1.0120 0.9812 1.0043 1.0198 0.9997 1.0005 1.0001
dispcorr: -0.036595997 hartree
energy: -1560.127759824262
dipole: 21.09678 -21.30869 -0.21191 -5.12800 4.50428 -0.62372 3.65168 -4.50628 -0.85461
magnitude: 1.07902 au
magnitude: 2.74265 debye
