program: Orca
programVersion: 5.0.2
elementType: F F O O O O N C C C C C C C C C C C C C C C C C C C C C C C C C C H H H H H H H H H H H H H H H H H H H H H H H
charge: 0
multiplicity: 1
keywords: wb97x-d3
keywords: def2-TZVPP
keywords: def2/J RIJCOSX
keywords: DEFGRID2
keywords: scfconv7
keywords: smallprint printgap noloewdin
keywords: NOSOSCF
formula: C26H23F2NO4
InChI: InChI=1/C26H23F2NO4/c1-17(2)24(18-11-13-21(14-12-18)32-26(27)28)25(30)33-23(16-29)19-7-6-10-22(15-19)31-20-8-4-3-5-9-20/h3-15,17,23-24,26H,1-2H3
56 atoms
F  -4.556058 -2.1260 1.26633
F  -3.725323 -2.297221 -0.724863
O  3.221199 0.393548 0.665895
O  3.606019 0.141846 -1.520888
O  -2.456381 -2.581001 1.085153
O  -1.48381 2.313238 0.820911
N  3.965563 2.724398 2.887781
C  3.018678 -1.787145 -0.159586
C  3.533975 -2.755902 -1.246465
C  1.548623 -1.937858 0.164158
C  3.568695 -4.175928 -0.689313
C  2.754784 -2.729533 -2.55655
C  3.32004 -0.336567 -0.461516
C  0.560737 -1.38342 -0.640224
C  1.14421 -2.674795 1.273579
C  3.335013 1.799456 0.526263
C  -0.787418 -1.574185 -0.374405
C  -0.193863 -2.865927 1.562847
C  -1.165298 -2.319726 0.734222
C  2.050323 2.426927 0.038682
C  0.839734 2.049804 0.607633
C  2.084997 3.387101 -0.95931
C  -0.328761 2.660477 0.18579
C  3.685472 2.302592 1.8569
C  0.907306 3.995419 -1.36951
C  -0.302671 3.643232 -0.797766
C  -3.471986 -1.865179 0.531258
C  -2.584442 1.930516 0.119981
C  -3.793408 1.980615 0.805666
C  -2.542123 1.457819 -1.187271
C  -4.954325 1.549632 0.184834
C  -3.71596 1.036196 -1.796977
C  -4.924482 1.075401 -1.119579
H  3.571641 -2.016827 0.758435
H  4.564846 -2.457127 -1.462612
H  2.564888 -4.539686 -0.462234
H  4.163538 -4.243367 0.223746
H  4.006265 -4.860851 -1.416089
H  3.23651 -3.388655 -3.279975
H  1.734315 -3.091088 -2.423055
H  2.715728 -1.736392 -2.999244
H  0.830952 -0.795134 -1.508542
H  1.889179 -3.108248 1.929487
H  4.151142 2.057873 -0.156766
H  -1.514197 -1.153465 -1.053779
H  -0.494306 -3.438332 2.430308
H  0.794043 1.292694 1.380653
H  3.026314 3.663088 -1.416529
H  0.932683 4.753438 -2.140474
H  -1.218567 4.128396 -1.109962
H  -3.28769 -0.786962 0.499752
H  -3.811919 2.349143 1.822887
H  -1.607521 1.411317 -1.730591
H  -5.889434 1.585482 0.72759
H  -3.676637 0.664181 -2.812144
H  -5.831424 0.735996 -1.600071
totalener: -1560.09204030 hartree
nucrepener: 3456.34982275 hartree
electener: -5016.44186304 hartree
oneelecener: -9003.08353339 hartree
twoeener: 3986.64167034 hartree
kineticenergy: 1553.71045022 hartree
xcener: -146.830818056557 hartree
chargesum: -0.0000000
charge: -0.181154 -0.194400 -0.256367 -0.339334 -0.259512 -0.289993 0.003415 0.062059 0.083900 0.070170 -0.299846 -0.301511 0.284213 -0.301378 -0.172326 0.304263 -0.149351 -0.161760 0.241956 0.076603 -0.242781 -0.136996 0.227717 -0.258613 -0.094247 -0.176697 0.492865 0.312118 -0.214755 -0.260454 -0.088367 -0.116097 -0.150984 0.091261 0.045890 0.090697 0.085058 0.095054 0.093692 0.085680 0.104389 0.132390 0.116036 0.123821 0.130314 0.127806 0.131871 0.111157 0.132312 0.139173 -0.006104 0.129171 0.141146 0.128369 0.130350 0.128113
qa: -0.1812 -0.1944 -0.2564 -0.3393 -0.2595 -0.2900 0.0034 0.0621 0.0839 0.0702 -0.2998 -0.3015 0.2842 -0.3014 -0.1723 0.3043 -0.1494 -0.1618 0.2420 0.0766 -0.2428 -0.1370 0.2277 -0.2586 -0.0942 -0.1767 0.4929 0.3121 -0.2148 -0.2605 -0.0884 -0.1161 -0.1510 0.0913 0.0459 0.0907 0.0851 0.0951 0.0937 0.0857 0.1044 0.1324 0.1160 0.1238 0.1303 0.1278 0.1319 0.1112 0.1323 0.1392 -0.0061 0.1292 0.1411 0.1284 0.1303 0.1281
va: 1.1105 1.0754 2.1294 2.1501 2.1389 2.1111 3.1197 3.7999 3.8251 3.5092 3.9374 3.9419 4.2876 4.0264 4.0156 3.8405 3.9065 4.0308 3.9569 3.6074 4.0685 4.0282 3.8394 4.0301 3.9399 3.9810 4.2798 3.6794 3.9795 3.8775 3.9058 3.9311 3.9475 1.0326 1.0194 1.0018 1.0049 1.0090 1.0088 0.9983 1.0169 1.0139 1.0066 1.0199 1.0135 1.0124 1.0226 1.0123 1.0002 1.0010 1.0111 1.0160 1.0026 1.0003 1.0019 1.0022
dispcorr: -0.035543876 hartree
energy: -1560.127584171013
dipole: 17.98560 -18.14859 -0.16300 -8.23287 8.26937 0.03650 -15.04608 13.77839 -1.26770
magnitude: 1.27865 au
magnitude: 3.25008 debye
