program: Orca
programVersion: 5.0.2
elementType: F F O O O O N C C C C C C C C C C C C C C C C C C C C C C C C C C H H H H H H H H H H H H H H H H H H H H H H H
charge: 0
multiplicity: 1
keywords: wb97x-d3
keywords: def2-TZVPP
keywords: def2/J RIJCOSX
keywords: DEFGRID2
keywords: scfconv7
keywords: smallprint printgap noloewdin
keywords: NOSOSCF
formula: C26H23F2NO4
InChI: InChI=1/C26H23F2NO4/c1-17(2)24(18-11-13-21(14-12-18)32-26(27)28)25(30)33-23(16-29)19-7-6-10-22(15-19)31-20-8-4-3-5-9-20/h3-15,17,23-24,26H,1-2H3
56 atoms
F  -3.063487 -2.972814 -1.651014
F  -3.082024 -0.80719 -1.632432
O  3.277468 0.41798 0.837692
O  3.866254 -0.281737 -1.205241
O  -2.516463 -1.906697 0.233727
O  -1.756731 1.227345 0.831579
N  3.272834 3.357632 2.359637
C  3.156597 -1.894769 0.453887
C  3.857772 -3.045853 -0.277498
C  1.642761 -1.931849 0.363479
C  5.371167 -2.964724 -0.102765
C  3.337588 -4.386756 0.229817
C  3.516484 -0.530086 -0.08707
C  0.855017 -1.98114 1.506316
C  1.004428 -1.857736 -0.867658
C  3.026886 1.726789 0.335027
C  -0.525228 -1.97465 1.421711
C  -0.377305 -1.848225 -0.973746
C  -1.142865 -1.910007 0.181968
C  1.642659 1.783007 -0.265205
C  0.538544 1.550727 0.545617
C  1.479381 1.988275 -1.625894
C  -0.729309 1.520719 -0.009511
C  3.167183 2.628646 1.478682
C  0.203503 1.959621 -2.17089
C  -0.903065 1.718309 -1.376026
C  -3.296488 -1.900188 -0.86647
C  -2.971716 1.833544 0.715587
C  -4.073382 1.098126 1.133396
C  -3.128515 3.141863 0.275831
C  -5.334525 1.669003 1.095347
C  -4.399205 3.696287 0.234736
C  -5.507249 2.96684 0.637092
H  3.433974 -1.932828 1.513004
H  3.630584 -2.967006 -1.344712
H  5.860065 -3.794717 -0.613849
H  5.647655 -3.025533 0.952515
H  5.788651 -2.044861 -0.509972
H  3.524814 -4.502878 1.300048
H  2.266603 -4.502516 0.066623
H  3.840773 -5.208805 -0.28016
H  1.323021 -2.022689 2.481923
H  1.58659 -1.790363 -1.777877
H  3.775052 2.010409 -0.411579
H  -1.130541 -2.009852 2.317399
H  -0.813481 -1.777747 -1.957561
H  0.651829 1.384747 1.609795
H  2.340068 2.153147 -2.260122
H  0.069573 2.109797 -3.233628
H  -1.889914 1.6811 -1.81644
H  -4.33661 -1.906787 -0.541236
H  -3.929519 0.091328 1.501341
H  -2.272339 3.731003 -0.025391
H  -6.188555 1.092781 1.426403
H  -4.517498 4.715032 -0.109353
H  -6.493708 3.408249 0.602838
totalener: -1560.09039721 hartree
nucrepener: 3514.70678728 hartree
electener: -5074.79718449 hartree
oneelecener: -9120.64807787 hartree
twoeener: 4045.85089338 hartree
kineticenergy: 1553.73715266 hartree
xcener: -146.834260498811 hartree
chargesum: 0.0000000
charge: -0.194047 -0.197542 -0.260904 -0.343012 -0.296105 -0.290768 0.000196 0.068112 0.055922 -0.036107 -0.274999 -0.281754 0.284549 -0.132083 -0.192337 0.337780 -0.142708 -0.127145 0.260688 0.069125 -0.278694 -0.130894 0.290629 -0.277708 -0.093445 -0.210242 0.423767 0.300921 -0.261748 -0.196102 -0.089543 -0.118744 -0.145545 0.086652 0.045693 0.083947 0.080531 0.101103 0.077728 0.101099 0.089893 0.106845 0.122056 0.120688 0.114957 0.108144 0.115982 0.114105 0.130477 0.134087 0.097298 0.137229 0.135400 0.124129 0.127386 0.125060
qa: -0.1940 -0.1975 -0.2609 -0.3430 -0.2961 -0.2908 0.0002 0.0681 0.0559 -0.0361 -0.2750 -0.2818 0.2845 -0.1321 -0.1923 0.3378 -0.1427 -0.1271 0.2607 0.0691 -0.2787 -0.1309 0.2906 -0.2777 -0.0934 -0.2102 0.4238 0.3009 -0.2617 -0.1961 -0.0895 -0.1187 -0.1455 0.0867 0.0457 0.0839 0.0805 0.1011 0.0777 0.1011 0.0899 0.1068 0.1221 0.1207 0.1150 0.1081 0.1160 0.1141 0.1305 0.1341 0.0973 0.1372 0.1354 0.1241 0.1274 0.1251
va: 1.1008 1.0791 2.1491 2.1504 2.1200 2.0697 3.1209 3.7542 3.8207 3.5613 3.9267 3.9470 4.3055 3.9948 4.0168 3.8220 4.0024 3.9575 3.7688 3.5790 4.1219 3.9954 3.6930 4.0458 3.9574 3.9574 4.2796 3.7895 4.0072 3.9614 3.9515 3.9536 3.9788 1.0367 1.0256 1.0072 1.0039 1.0148 1.0049 1.0036 1.0075 1.0106 1.0242 1.0173 1.0138 1.0406 1.0339 1.0175 0.9989 1.0147 0.9815 1.0190 1.0047 1.0008 0.9999 1.0004
dispcorr: -0.037527356 hartree
energy: -1560.127924560969
dipole: 17.51048 -18.49826 -0.98778 -10.13620 9.27638 -0.85982 1.82393 -2.51636 -0.69243
magnitude: 1.48137 au
magnitude: 3.76535 debye
