program: Orca
programVersion: 5.0.2
elementType: F F O O O O N C C C C C C C C C C C C C C C C C C C C C C C C C C H H H H H H H H H H H H H H H H H H H H H H H
charge: 0
multiplicity: 1
keywords: wb97x-d3
keywords: def2-TZVPP
keywords: def2/J RIJCOSX
keywords: DEFGRID2
keywords: scfconv7
keywords: smallprint printgap noloewdin
keywords: NOSOSCF
formula: C26H23F2NO4
InChI: InChI=1/C26H23F2NO4/c1-17(2)24(18-11-13-21(14-12-18)32-26(27)28)25(30)33-23(16-29)19-7-6-10-22(15-19)31-20-8-4-3-5-9-20/h3-15,17,23-24,26H,1-2H3
56 atoms
F  -3.629632 -1.745248 2.040805
F  -3.526246 -3.467665 3.344763
O  3.052443 0.55816 -0.012048
O  1.950211 0.482788 -1.959084
O  -1.666041 -2.542915 2.735708
O  -2.255238 2.653325 -0.23079
N  4.229673 2.915672 1.972882
C  2.604975 -1.578307 -0.87498
C  2.579332 -2.361949 -2.192918
C  1.450987 -1.894766 0.05905
C  3.766231 -1.991949 -3.077221
C  2.576415 -3.860467 -1.911077
C  2.511382 -0.079863 -1.062453
C  1.67197 -2.331011 1.360251
C  0.138626 -1.683604 -0.345191
C  2.577136 1.881495 0.235032
C  0.618055 -2.564602 2.2265
C  -0.92868 -1.8894 0.513949
C  -0.683697 -2.336109 1.80498
C  1.165517 1.813972 0.765735
C  0.12283 2.321204 0.007023
C  0.912925 1.154386 1.963146
C  -1.186425 2.151073 0.444244
C  3.508037 2.452768 1.209015
C  -0.39301 1.002185 2.39235
C  -1.446581 1.486216 1.632868
C  -2.918491 -2.862043 2.321417
C  -2.316683 2.619709 -1.593421
C  -1.749399 1.605709 -2.355564
C  -3.036976 3.637562 -2.204264
C  -1.906755 1.623565 -3.733307
C  -3.194548 3.635539 -3.580418
C  -2.628088 2.632211 -4.353067
H  3.54004 -1.805101 -0.351617
H  1.661067 -2.108039 -2.730851
H  3.754462 -2.577057 -3.997307
H  4.712608 -2.200501 -2.572683
H  3.759653 -0.941326 -3.364263
H  1.7133 -4.168902 -1.321859
H  2.559262 -4.424647 -2.843856
H  3.475146 -4.159656 -1.366307
H  2.685007 -2.494064 1.706641
H  -0.066861 -1.323857 -1.345431
H  2.618528 2.489763 -0.67386
H  0.799971 -2.912391 3.234857
H  -1.92666 -1.651101 0.173114
H  0.328025 2.826569 -0.928362
H  1.727676 0.756423 2.553932
H  -0.599182 0.484731 3.31927
H  -2.469953 1.353127 1.957997
H  -2.932224 -3.512193 1.439779
H  -1.179946 0.812823 -1.889183
H  -3.473602 4.419023 -1.596476
H  -1.457029 0.836475 -4.323815
H  -3.759127 4.429764 -4.050612
H  -2.747713 2.636756 -5.427768
totalener: -1560.09039600 hartree
nucrepener: 3458.00965886 hartree
electener: -5018.10005487 hartree
oneelecener: -9006.44507012 hartree
twoeener: 3988.34501526 hartree
kineticenergy: 1553.71620829 hartree
xcener: -146.829269061335 hartree
chargesum: 0.0000000
charge: -0.189772 -0.174638 -0.254762 -0.348360 -0.257993 -0.295211 0.001230 0.076455 0.050852 -0.026592 -0.277072 -0.280880 0.281816 -0.117637 -0.201900 0.318346 -0.172200 -0.132484 0.211316 0.090618 -0.205343 -0.247561 0.289832 -0.265569 -0.045504 -0.243889 0.373661 0.255874 -0.123962 -0.204165 -0.144053 -0.098163 -0.131858 0.088159 0.045283 0.084798 0.082907 0.103049 0.098371 0.091466 0.079979 0.110740 0.127973 0.119143 0.130428 0.132563 0.126285 0.120200 0.135769 0.131536 0.088509 0.091313 0.126148 0.123985 0.125605 0.125359
qa: -0.1898 -0.1746 -0.2548 -0.3484 -0.2580 -0.2952 0.0012 0.0765 0.0509 -0.0266 -0.2771 -0.2809 0.2818 -0.1176 -0.2019 0.3183 -0.1722 -0.1325 0.2113 0.0906 -0.2053 -0.2476 0.2898 -0.2656 -0.0455 -0.2439 0.3737 0.2559 -0.1240 -0.2042 -0.1441 -0.0982 -0.1319 0.0882 0.0453 0.0848 0.0829 0.1030 0.0984 0.0915 0.0800 0.1107 0.1280 0.1191 0.1304 0.1326 0.1263 0.1202 0.1358 0.1315 0.0885 0.0913 0.1261 0.1240 0.1256 0.1254
va: 1.0758 1.1131 2.1529 2.1400 2.0741 2.1246 3.1191 3.7435 3.8293 3.5606 3.9256 3.9453 4.3054 3.9773 4.0437 3.8400 4.0076 3.8440 3.8472 3.5466 3.9772 4.0261 3.8019 4.0367 3.8547 4.0216 4.2985 3.8044 3.9019 4.0185 3.9926 3.9473 3.9505 1.0374 1.0236 1.0071 1.0040 1.0145 1.0038 1.0075 1.0052 1.0097 1.0140 1.0186 1.0101 1.0186 1.0142 1.0194 0.9972 1.0175 0.9847 1.0122 1.0147 1.0009 0.9990 1.0002
dispcorr: -0.036148908 hartree
energy: -1560.126544910723
dipole: 18.63841 -18.92853 -0.29012 -7.63721 6.27821 -1.35900 -27.40560 26.15786 -1.24774
magnitude: 1.86760 au
magnitude: 4.74705 debye
