program: Orca
programVersion: 5.0.2
elementType: F F O O O O N C C C C C C C C C C C C C C C C C C C C C C C C C C H H H H H H H H H H H H H H H H H H H H H H H
charge: 0
multiplicity: 1
keywords: wb97x-d3
keywords: def2-TZVPP
keywords: def2/J RIJCOSX
keywords: DEFGRID2
keywords: scfconv7
keywords: smallprint printgap noloewdin
keywords: NOSOSCF
formula: C26H23F2NO4
InChI: InChI=1/C26H23F2NO4/c1-17(2)24(18-11-13-21(14-12-18)32-26(27)28)25(30)33-23(16-29)19-7-6-10-22(15-19)31-20-8-4-3-5-9-20/h3-15,17,23-24,26H,1-2H3
56 atoms
F  -4.448777 -1.194017 -1.73714
F  -3.061261 -2.387393 -2.890841
O  2.848215 0.535209 0.903581
O  3.845262 -0.275647 -0.928134
O  -2.68798 -1.947028 -0.737625
O  -2.093305 1.411039 -0.401856
N  2.603757 3.578069 2.214179
C  2.810159 -1.797656 0.643514
C  3.647158 -2.978725 0.135593
C  1.345577 -1.861423 0.254966
C  5.093534 -2.868482 0.608928
C  3.039141 -4.297445 0.600759
C  3.271295 -0.46327 0.105548
C  0.346242 -1.852888 1.220866
C  0.968058 -1.881766 -1.08129
C  2.755539 1.815095 0.293005
C  -0.991009 -1.871575 0.868005
C  -0.366477 -1.915611 -1.454141
C  -1.347496 -1.904848 -0.472317
C  1.534102 1.885895 -0.593609
C  0.285608 1.619263 -0.043689
C  1.666696 2.173919 -1.942472
C  -0.839897 1.684747 -0.850212
C  2.673009 2.786072 1.385143
C  0.534649 2.220412 -2.742943
C  -0.717007 1.989079 -2.201811
C  -3.150392 -1.453875 -1.915555
C  -2.481503 1.721865 0.873412
C  -3.371687 0.850796 1.484837
C  -2.072438 2.882694 1.517523
C  -3.845118 1.141008 2.754715
C  -2.546507 3.15272 2.792381
C  -3.430833 2.286627 3.417704
H  2.870023 -1.770809 1.737015
H  3.642163 -2.961667 -0.958214
H  5.584065 -1.966598 0.245168
H  5.676936 -3.718276 0.253286
H  5.150546 -2.870461 1.700038
H  3.008498 -4.354251 1.691554
H  2.02319 -4.438239 0.233193
H  3.637347 -5.137986 0.247975
H  0.61317 -1.823347 2.269982
H  1.720629 -1.872194 -1.859621
H  3.654956 2.038807 -0.289179
H  -1.761009 -1.856171 1.627829
H  -0.61326 -1.971447 -2.50497
H  0.192942 1.366449 1.005366
H  2.644781 2.354525 -2.368186
H  0.627154 2.447986 -3.796238
H  -1.605586 2.048312 -2.817304
H  -2.627088 -0.552142 -2.246185
H  -3.700723 -0.036907 0.961527
H  -1.392792 3.574987 1.037881
H  -4.542684 0.462121 3.227126
H  -2.221444 4.054083 3.294452
H  -3.797804 2.505835 4.41106
totalener: -1560.09379820 hartree
nucrepener: 3520.82135657 hartree
electener: -5080.91515477 hartree
oneelecener: -9132.16552705 hartree
twoeener: 4051.25037228 hartree
kineticenergy: 1553.72256947 hartree
xcener: -146.831043199359 hartree
chargesum: -0.0000000
charge: -0.181838 -0.192930 -0.266167 -0.340250 -0.262140 -0.309618 -0.000539 0.071871 0.054032 -0.034319 -0.276492 -0.280339 0.280320 -0.133998 -0.157573 0.333916 -0.175023 -0.160312 0.243467 0.057910 -0.242512 -0.135176 0.246676 -0.270255 -0.077818 -0.234242 0.416170 0.335016 -0.290762 -0.199543 -0.082986 -0.106680 -0.151570 0.087260 0.045262 0.102082 0.085347 0.080533 0.078030 0.101322 0.091299 0.110240 0.123792 0.123930 0.122443 0.124059 0.133908 0.113946 0.130395 0.137071 0.062150 0.145326 0.136716 0.129710 0.131913 0.126971
qa: -0.1818 -0.1929 -0.2662 -0.3403 -0.2621 -0.3096 -0.0005 0.0719 0.0540 -0.0343 -0.2765 -0.2803 0.2803 -0.1340 -0.1576 0.3339 -0.1750 -0.1603 0.2435 0.0579 -0.2425 -0.1352 0.2467 -0.2703 -0.0778 -0.2342 0.4162 0.3350 -0.2908 -0.1995 -0.0830 -0.1067 -0.1516 0.0873 0.0453 0.1021 0.0853 0.0805 0.0780 0.1013 0.0913 0.1102 0.1238 0.1239 0.1224 0.1241 0.1339 0.1139 0.1304 0.1371 0.0622 0.1453 0.1367 0.1297 0.1319 0.1270
va: 1.1026 1.0836 2.1447 2.1537 2.0687 2.0566 3.1188 3.7491 3.8242 3.5560 3.9285 3.9466 4.3158 3.9714 3.9868 3.8373 3.9923 3.9241 3.8222 3.6475 3.9902 4.0073 3.7039 4.0385 3.9551 4.0442 4.2708 3.7172 4.0109 3.9794 3.9488 3.9559 3.9783 1.0365 1.0259 1.0143 1.0072 1.0041 1.0050 1.0036 1.0076 1.0105 1.0231 1.0192 1.0137 1.0221 1.0172 1.0149 0.9989 1.0068 1.0019 1.0221 1.0041 0.9996 0.9989 1.0000
dispcorr: -0.037631023 hartree
energy: -1560.131429218670
dipole: 24.57541 -24.21175 0.36366 -10.24176 9.79284 -0.44893 10.96500 -11.26713 -0.30212
magnitude: 0.65197 au
magnitude: 1.65717 debye
