program: Orca
programVersion: 5.0.2
elementType: F F O O O O N C C C C C C C C C C C C C C C C C C C C C C C C C C H H H H H H H H H H H H H H H H H H H H H H H
charge: 0
multiplicity: 1
keywords: wb97x-d3
keywords: def2-TZVPP
keywords: def2/J RIJCOSX
keywords: DEFGRID2
keywords: scfconv7
keywords: smallprint printgap noloewdin
keywords: NOSOSCF
formula: C26H23F2NO4
InChI: InChI=1/C26H23F2NO4/c1-17(2)24(18-11-13-21(14-12-18)32-26(27)28)25(30)33-23(16-29)19-7-6-10-22(15-19)31-20-8-4-3-5-9-20/h3-15,17,23-24,26H,1-2H3
56 atoms
F  -3.398143 -3.384181 1.362009
F  -3.560587 -2.800086 -0.706666
O  3.245469 0.358145 0.82572
O  3.459444 -0.102749 -1.353024
O  -2.811102 -1.309011 0.785643
O  -1.476362 2.139062 0.897822
N  4.07543 2.889221 2.782507
C  2.802558 -1.85538 0.188575
C  3.281044 -2.951979 -0.773013
C  1.296433 -1.772747 0.337321
C  4.804911 -3.027952 -0.798019
C  2.692664 -4.300848 -0.372562
C  3.230495 -0.467785 -0.2364
C  0.697294 -1.888552 1.584915
C  0.489508 -1.527947 -0.769698
C  3.346621 1.744737 0.548891
C  -0.675859 -1.768105 1.731783
C  -0.883084 -1.410231 -0.637032
C  -1.46006 -1.520729 0.61864
C  2.037604 2.329059 0.067646
C  0.842555 1.932517 0.653291
C  2.04168 3.282561 -0.938163
C  -0.346321 2.512475 0.239276
C  3.753449 2.370599 1.809647
C  0.846905 3.862067 -1.3379
C  -0.350084 3.489303 -0.750622
C  -3.662258 -2.332692 0.556512
C  -2.62976 1.843181 0.237289
C  -2.67496 1.425573 -1.086267
C  -3.79509 1.91726 0.989169
C  -3.894002 1.066667 -1.642848
C  -5.003485 1.554441 0.42042
C  -5.06165 1.124147 -0.89814
H  3.227893 -2.054584 1.178173
H  2.933167 -2.706493 -1.78065
H  5.264348 -2.099594 -1.134909
H  5.136902 -3.815541 -1.475161
H  5.201441 -3.263364 0.19253
H  2.992972 -4.577318 0.641034
H  1.603804 -4.304874 -0.407102
H  3.046962 -5.08483 -1.042455
H  1.309425 -2.072856 2.459004
H  0.933009 -1.415355 -1.751144
H  4.128865 1.937961 -0.193183
H  -1.133031 -1.84568 2.708801
H  -1.499253 -1.209064 -1.501361
H  0.817647 1.18145 1.433207
H  2.971463 3.575272 -1.408783
H  0.847128 4.61495 -2.114466
H  -1.277439 3.955448 -1.05745
H  -4.675828 -1.974066 0.73233
H  -1.772108 1.362707 -1.678932
H  -3.742151 2.245675 2.018751
H  -3.925273 0.735372 -2.672646
H  -5.907342 1.615203 1.012467
H  -6.007502 0.845621 -1.342651
totalener: -1560.09081959 hartree
nucrepener: 3491.32808344 hartree
electener: -5051.41890303 hartree
oneelecener: -9073.86529957 hartree
twoeener: 4022.44639654 hartree
kineticenergy: 1553.73610543 hartree
xcener: -146.830788427803 hartree
chargesum: -0.0000000
charge: -0.196082 -0.199876 -0.261281 -0.337591 -0.303332 -0.292059 0.002169 0.070756 0.058335 -0.036796 -0.277525 -0.279814 0.270595 -0.160039 -0.112135 0.292832 -0.132510 -0.180495 0.232298 0.096849 -0.244417 -0.147154 0.236063 -0.258700 -0.098374 -0.187384 0.424783 0.334400 -0.232905 -0.226333 -0.105423 -0.092909 -0.183330 0.087928 0.046135 0.100309 0.085174 0.081358 0.078345 0.103026 0.090059 0.108363 0.124791 0.125645 0.124874 0.129169 0.138105 0.108212 0.130141 0.139299 0.083945 0.137814 0.122596 0.127228 0.127156 0.127715
qa: -0.1961 -0.1999 -0.2613 -0.3376 -0.3033 -0.2921 0.0022 0.0708 0.0583 -0.0368 -0.2775 -0.2798 0.2706 -0.1600 -0.1121 0.2928 -0.1325 -0.1805 0.2323 0.0968 -0.2444 -0.1472 0.2361 -0.2587 -0.0984 -0.1874 0.4248 0.3344 -0.2329 -0.2263 -0.1054 -0.0929 -0.1833 0.0879 0.0461 0.1003 0.0852 0.0814 0.0783 0.1030 0.0901 0.1084 0.1248 0.1256 0.1249 0.1292 0.1381 0.1082 0.1301 0.1393 0.0839 0.1378 0.1226 0.1272 0.1272 0.1277
va: 1.0915 1.0821 2.1354 2.1561 2.0565 2.0962 3.1209 3.7576 3.8223 3.5144 3.9311 3.9465 4.2894 3.9856 3.9360 3.8410 4.0988 4.0506 3.7567 3.6314 4.0754 4.0323 3.8500 4.0265 3.9449 3.9766 4.2927 3.6449 3.8883 4.0460 3.9487 3.9074 3.9609 1.0360 1.0256 1.0146 1.0073 1.0041 1.0051 1.0034 1.0075 1.0130 1.0212 1.0189 1.0110 1.0080 1.0134 1.0119 1.0006 1.0014 0.9861 1.0010 1.0158 0.9996 0.9980 1.0003
dispcorr: -0.036632026 hartree
energy: -1560.127451617464
dipole: 16.55838 -17.38543 -0.82705 -7.41954 6.99715 -0.42238 -9.92725 8.90542 -1.02183
magnitude: 1.38078 au
magnitude: 3.50967 debye
