program: Orca
programVersion: 5.0.2
elementType: F F O O O O N C C C C C C C C C C C C C C C C C C C C C C C C C C H H H H H H H H H H H H H H H H H H H H H H H
charge: 0
multiplicity: 1
keywords: wb97x-d3
keywords: def2-TZVPP
keywords: def2/J RIJCOSX
keywords: DEFGRID2
keywords: scfconv7
keywords: smallprint printgap noloewdin
keywords: NOSOSCF
formula: C26H23F2NO4
InChI: InChI=1/C26H23F2NO4/c1-17(2)24(18-11-13-21(14-12-18)32-26(27)28)25(30)33-23(16-29)19-7-6-10-22(15-19)31-20-8-4-3-5-9-20/h3-15,17,23-24,26H,1-2H3
56 atoms
F  -3.560455 -3.512893 -0.369515
F  -2.644436 -3.537528 -2.321066
O  2.720205 0.519775 1.163538
O  3.809084 -0.156906 -0.671023
O  -2.790566 -1.59345 -1.22767
O  -1.966884 1.863216 -0.637011
N  2.407112 3.366837 2.809498
C  2.563973 -1.760448 0.648101
C  3.363222 -2.939322 0.077175
C  1.131393 -1.70039 0.154871
C  4.766176 -2.985289 0.675035
C  2.631402 -4.251307 0.340636
C  3.144944 -0.412615 0.29197
C  0.068973 -1.78757 1.043941
C  0.857443 -1.530087 -1.199166
C  2.759504 1.864397 0.701775
C  -1.242708 -1.758887 0.596284
C  -0.446774 -1.499254 -1.659159
C  -1.489943 -1.631013 -0.75864
C  1.674233 2.099025 -0.321794
C  0.35001 1.877595 0.038071
C  2.003887 2.47304 -1.614188
C  -0.651914 2.070647 -0.901109
C  2.564349 2.695602 1.890958
C  0.993803 2.644886 -2.549956
C  -0.329957 2.453807 -2.19868
C  -3.389148 -2.77991 -1.491396
C  -2.475828 2.08554 0.6121
C  -2.121916 3.192986 1.37312
C  -3.424384 1.185776 1.07535
C  -2.713927 3.381625 2.612251
C  -4.016815 1.394711 2.311121
C  -3.660543 2.486606 3.088333
H  2.542975 -1.849605 1.739682
H  3.453467 -2.804206 -1.004677
H  5.341881 -2.08669 0.457196
H  5.325011 -3.83153 0.274199
H  4.725746 -3.107684 1.759964
H  3.209548 -5.093408 -0.040813
H  2.484414 -4.413794 1.411126
H  1.6522 -4.28081 -0.135841
H  0.263182 -1.8911 2.104076
H  1.666644 -1.41924 -1.909805
H  3.738301 2.105596 0.275317
H  -2.061072 -1.826579 1.299544
H  -0.653852 -1.363784 -2.711776
H  0.103773 1.556824 1.043002
H  3.038999 2.618074 -1.89302
H  1.240428 2.937077 -3.561754
H  -1.122897 2.598062 -2.920613
H  -4.359775 -2.579058 -1.943632
H  -1.391989 3.904626 1.009356
H  -3.696645 0.337347 0.462032
H  -2.431315 4.240419 3.206358
H  -4.759097 0.693327 2.668867
H  -4.119598 2.642225 4.055105
totalener: -1560.09183149 hartree
nucrepener: 3497.19638507 hartree
electener: -5057.28821656 hartree
oneelecener: -9085.79139774 hartree
twoeener: 4028.50318118 hartree
kineticenergy: 1553.74647417 hartree
xcener: -146.831110448229 hartree
chargesum: 0.0000000
charge: -0.196571 -0.191869 -0.262736 -0.340202 -0.331597 -0.296628 -0.001574 0.065123 0.059003 -0.019733 -0.275969 -0.279674 0.281957 -0.144789 -0.131552 0.340573 -0.127714 -0.174226 0.251007 0.050046 -0.220892 -0.129525 0.243043 -0.274568 -0.081860 -0.232480 0.408658 0.283665 -0.180200 -0.252668 -0.109115 -0.090233 -0.143335 0.086941 0.044854 0.101070 0.085063 0.080185 0.090587 0.077470 0.102798 0.108575 0.123443 0.122781 0.120197 0.120488 0.128551 0.111584 0.127570 0.128231 0.093731 0.132967 0.139291 0.130394 0.124257 0.125607
qa: -0.1966 -0.1919 -0.2627 -0.3402 -0.3316 -0.2966 -0.0016 0.0651 0.0590 -0.0197 -0.2760 -0.2797 0.2820 -0.1448 -0.1316 0.3406 -0.1277 -0.1742 0.2510 0.0500 -0.2209 -0.1295 0.2430 -0.2746 -0.0819 -0.2325 0.4087 0.2837 -0.1802 -0.2527 -0.1091 -0.0902 -0.1433 0.0869 0.0449 0.1011 0.0851 0.0802 0.0906 0.0775 0.1028 0.1086 0.1234 0.1228 0.1202 0.1205 0.1286 0.1116 0.1276 0.1282 0.0937 0.1330 0.1393 0.1304 0.1243 0.1256
va: 1.0867 1.0951 2.1483 2.1543 2.0260 2.0839 3.1199 3.7582 3.8206 3.5267 3.9305 3.9470 4.3101 3.9631 3.9299 3.8353 4.0335 4.1070 3.6768 3.6305 3.9571 3.9909 3.7393 4.0418 3.9460 4.0596 4.2970 3.7778 3.9560 3.9896 3.9512 3.9364 3.9698 1.0368 1.0265 1.0145 1.0073 1.0041 1.0075 1.0052 1.0038 1.0120 1.0208 1.0169 1.0147 1.0131 1.0179 1.0167 0.9990 1.0124 0.9802 1.0045 1.0201 0.9994 1.0004 1.0001
dispcorr: -0.036405374 hartree
energy: -1560.128236864025
dipole: 19.38940 -19.73526 -0.34586 -5.24120 4.66640 -0.57480 6.46497 -7.17539 -0.71041
magnitude: 0.97709 au
magnitude: 2.48357 debye
