program: Orca
programVersion: 5.0.2
elementType: F F O O O O N C C C C C C C C C C C C C C C C C C C C C C C C C C H H H H H H H H H H H H H H H H H H H H H H H
charge: 0
multiplicity: 1
keywords: wb97x-d3
keywords: def2-TZVPP
keywords: def2/J RIJCOSX
keywords: DEFGRID2
keywords: scfconv7
keywords: smallprint printgap noloewdin
keywords: NOSOSCF
formula: C26H23F2NO4
InChI: InChI=1/C26H23F2NO4/c1-17(2)24(18-11-13-21(14-12-18)32-26(27)28)25(30)33-23(16-29)19-7-6-10-22(15-19)31-20-8-4-3-5-9-20/h3-15,17,23-24,26H,1-2H3
56 atoms
F  -3.544218 -3.708437 -0.294777
F  -2.700204 -3.75616 -2.276863
O  2.681572 0.502939 1.120989
O  3.703872 -0.181235 -0.748116
O  -2.882808 -1.787651 -1.233521
O  -1.857979 2.069383 -0.772282
N  2.540513 3.318428 2.84888
C  2.483597 -1.774322 0.607489
C  3.288438 -2.957198 0.050818
C  1.04807 -1.739552 0.123484
C  4.69477 -2.983496 0.64169
C  2.567756 -4.270306 0.3386
C  3.063238 -0.4311 0.231845
C  -0.006815 -1.799841 1.023805
C  0.763315 -1.640465 -1.235321
C  2.819445 1.85356 0.703345
C  -1.32134 -1.817014 0.584305
C  -0.543704 -1.661701 -1.687892
C  -1.578108 -1.768457 -0.774025
C  1.770761 2.217172 -0.320634
C  0.435264 1.957284 -0.039071
C  2.142413 2.787946 -1.526833
C  -0.535194 2.307169 -0.966488
C  2.663935 2.659906 1.916104
C  1.16379 3.120538 -2.451777
C  -0.171989 2.890403 -2.175194
C  -3.444028 -3.003235 -1.441817
C  -2.405314 2.162307 0.477009
C  -2.058283 3.171735 1.366628
C  -3.380019 1.2331 0.809732
C  -2.685335 3.233123 2.601264
C  -4.007895 1.315883 2.0431
C  -3.659512 2.308298 2.947108
H  2.470383 -1.84802 1.700201
H  3.3727 -2.838533 -1.033374
H  5.263264 -2.084658 0.406149
H  5.25749 -3.831983 0.25131
H  4.660907 -3.088605 1.728616
H  3.148904 -5.113418 -0.03588
H  2.430868 -4.418638 1.412435
H  1.584933 -4.313937 -0.129133
H  0.195735 -1.849209 2.086254
H  1.567001 -1.551979 -1.955287
H  3.819049 2.038339 0.296763
H  -2.135168 -1.86238 1.294588
H  -0.759823 -1.589131 -2.744934
H  0.153069 1.489317 0.896246
H  3.18675 2.964817 -1.747932
H  1.444034 3.567498 -3.396002
H  -0.940666 3.156446 -2.888609
H  -4.436915 -2.852947 -1.864552
H  -1.306261 3.905209 1.1058
H  -3.641492 0.458677 0.101163
H  -2.408783 4.016274 3.29454
H  -4.771614 0.593232 2.299117
H  -4.146746 2.364755 3.910958
totalener: -1560.09251105 hartree
nucrepener: 3470.11384305 hartree
electener: -5030.20635410 hartree
oneelecener: -9031.58907825 hartree
twoeener: 4001.38272414 hartree
kineticenergy: 1553.74590624 hartree
xcener: -146.829595112538 hartree
chargesum: -0.0000000
charge: -0.194958 -0.192107 -0.264401 -0.338694 -0.330594 -0.300391 -0.000971 0.076679 0.054651 -0.030515 -0.276499 -0.278826 0.275233 -0.145819 -0.119851 0.327991 -0.129986 -0.181885 0.249586 0.086692 -0.244770 -0.139965 0.242121 -0.266419 -0.085662 -0.221175 0.410801 0.278645 -0.170771 -0.252026 -0.112657 -0.097438 -0.140976 0.086166 0.045884 0.100506 0.085341 0.080727 0.090475 0.077868 0.102852 0.109777 0.125014 0.123679 0.118812 0.123001 0.131742 0.108576 0.127732 0.128613 0.091528 0.132901 0.142798 0.130399 0.124937 0.125629
qa: -0.1950 -0.1921 -0.2644 -0.3387 -0.3306 -0.3004 -0.0010 0.0767 0.0547 -0.0305 -0.2765 -0.2788 0.2752 -0.1458 -0.1199 0.3280 -0.1300 -0.1819 0.2496 0.0867 -0.2448 -0.1400 0.2421 -0.2664 -0.0857 -0.2212 0.4108 0.2786 -0.1708 -0.2520 -0.1127 -0.0974 -0.1410 0.0862 0.0459 0.1005 0.0853 0.0807 0.0905 0.0779 0.1029 0.1098 0.1250 0.1237 0.1188 0.1230 0.1317 0.1086 0.1277 0.1286 0.0915 0.1329 0.1428 0.1304 0.1249 0.1256
va: 1.0888 1.0941 2.1428 2.1566 2.0325 2.0898 3.1205 3.7534 3.8252 3.5267 3.9313 3.9466 4.3061 3.9470 3.9368 3.8382 4.0285 4.1202 3.7100 3.5975 3.9707 4.0127 3.7543 4.0370 3.9525 4.0747 4.3003 3.7698 3.9433 3.9872 3.9541 3.9319 3.9671 1.0373 1.0265 1.0144 1.0073 1.0041 1.0075 1.0053 1.0039 1.0119 1.0199 1.0176 1.0167 1.0121 1.0145 1.0145 0.9996 1.0119 0.9802 1.0045 1.0164 0.9994 0.9999 1.0000
dispcorr: -0.035164759 hartree
energy: -1560.127675812070
dipole: 19.19760 -19.53171 -0.33411 -4.52594 3.94916 -0.57678 6.34588 -7.03679 -0.69090
magnitude: 0.96003 au
magnitude: 2.44020 debye
