program: Orca
programVersion: 5.0.2
elementType: F F O O O O N C C C C C C C C C C C C C C C C C C C C C C C C C C H H H H H H H H H H H H H H H H H H H H H H H
charge: 0
multiplicity: 1
keywords: wb97x-d3
keywords: def2-TZVPP
keywords: def2/J RIJCOSX
keywords: DEFGRID2
keywords: scfconv7
keywords: smallprint printgap noloewdin
keywords: NOSOSCF
formula: C26H23F2NO4
InChI: InChI=1/C26H23F2NO4/c1-17(2)24(18-11-13-21(14-12-18)32-26(27)28)25(30)33-23(16-29)19-7-6-10-22(15-19)31-20-8-4-3-5-9-20/h3-15,17,23-24,26H,1-2H3
56 atoms
F  -3.581137 -2.624486 1.189709
F  -2.814341 -3.979989 -0.308733
O  3.177227 0.402394 0.864465
O  3.894531 -0.009267 -1.211972
O  -2.495566 -1.787479 -0.58386
O  -1.835398 1.3226 0.355861
N  2.98099 3.02871 2.842366
C  3.132542 -1.840579 0.178347
C  3.915344 -2.869374 -0.647478
C  1.627476 -1.89112 -0.014739
C  5.407037 -2.786238 -0.339355
C  3.398832 -4.274478 -0.360777
C  3.488162 -0.412251 -0.15605
C  0.780949 -2.061173 1.072997
C  1.061282 -1.698337 -1.272667
C  2.991332 1.780674 0.548062
C  -0.599335 -2.049225 0.92593
C  -0.312989 -1.695839 -1.437862
C  -1.138804 -1.86958 -0.338567
C  1.689146 1.970162 -0.191532
C  0.493169 1.618713 0.42767
C  1.694969 2.422908 -1.501837
C  -0.693725 1.720187 -0.277571
C  2.991047 2.470899 1.838726
C  0.496748 2.513857 -2.198077
C  -0.699017 2.157117 -1.59857
C  -3.34036 -2.748191 -0.139926
C  -2.971934 2.078009 0.255402
C  -2.941715 3.467068 0.216085
C  -4.181893 1.397513 0.252113
C  -4.137071 4.169201 0.155597
C  -5.368295 2.114412 0.203028
C  -5.353483 3.501057 0.145302
H  3.344089 -2.01154 1.238717
H  3.764949 -2.657469 -1.710475
H  5.831386 -1.805843 -0.559108
H  5.961138 -3.515429 -0.932394
H  5.60146 -3.004489 0.713499
H  3.976609 -5.013804 -0.917461
H  3.487107 -4.520059 0.700478
H  2.353381 -4.399617 -0.644243
H  1.199513 -2.198554 2.062555
H  1.68916 -1.549027 -2.142287
H  3.827415 2.176681 -0.036506
H  -1.222007 -2.160245 1.801977
H  -0.745446 -1.543551 -2.418682
H  0.474803 1.268415 1.453511
H  2.625816 2.696607 -1.981364
H  0.495694 2.854866 -3.224867
H  -1.625097 2.218271 -2.15632
H  -4.283109 -2.663349 -0.677602
H  -2.002676 4.005529 0.236551
H  -4.194468 0.316166 0.297304
H  -4.111464 5.25068 0.12077
H  -6.309524 1.580032 0.201348
H  -6.280744 4.056419 0.097023
elementType: F O N C H
totalener: -1560.11728792 hartree
nucrepener: 3451.91630232 hartree
electener: -5012.03359024 hartree
oneelecener: -8996.04189185 hartree
twoeener: 3984.00830161 hartree
cpcmener: -0.03607204 hartree
kineticenergy: 1553.65727377 hartree
xcener: -146.819257226677 hartree
chargesum: -0.0000000
charge: -0.221844 -0.210936 -0.277103 -0.415037 -0.334943 -0.324861 -0.085718 0.125772 0.064177 -0.011068 -0.293341 -0.309804 0.317201 -0.182406 -0.190291 0.414690 -0.137661 -0.192314 0.222636 0.068561 -0.290266 -0.176386 0.242251 -0.240380 -0.108705 -0.190602 0.441077 0.271811 -0.178584 -0.229663 -0.159099 -0.144355 -0.173971 0.098673 0.044789 0.094986 0.093020 0.088237 0.097477 0.089425 0.098144 0.137959 0.140286 0.140770 0.149184 0.145357 0.133778 0.145199 0.160300 0.158230 0.133664 0.153141 0.138512 0.158359 0.154606 0.157065
qa: -0.2218 -0.2109 -0.2771 -0.4150 -0.3349 -0.3249 -0.0857 0.1258 0.0642 -0.0111 -0.2933 -0.3098 0.3172 -0.1824 -0.1903 0.4147 -0.1377 -0.1923 0.2226 0.0686 -0.2903 -0.1764 0.2423 -0.2404 -0.1087 -0.1906 0.4411 0.2718 -0.1786 -0.2297 -0.1591 -0.1444 -0.1740 0.0987 0.0448 0.0950 0.0930 0.0882 0.0975 0.0894 0.0981 0.1380 0.1403 0.1408 0.1492 0.1454 0.1338 0.1452 0.1603 0.1582 0.1337 0.1531 0.1385 0.1584 0.1546 0.1571
va: 1.0505 1.0726 2.1509 2.0836 2.0442 2.0271 3.1117 3.6682 3.8119 3.4729 3.9265 3.9493 4.2902 3.9604 3.9268 3.7388 3.9688 3.9902 3.6403 3.5369 4.0625 3.9567 3.6872 4.0866 3.8933 3.9467 4.2176 3.7261 3.8982 3.9619 3.9041 3.9278 3.8953 1.0368 1.0266 1.0134 1.0045 1.0021 1.0046 1.0021 1.0010 1.0051 1.0160 1.0129 1.0155 1.0056 1.0268 1.0075 0.9892 0.9966 0.9762 0.9988 1.0224 0.9908 0.9921 0.9903
dispcorr: -0.035393396 hartree
energy: -1560.152681312947
dipole: 19.19242 -19.80053 -0.60811 -3.45105 2.99795 -0.45310 -8.22259 6.46836 -1.75423
magnitude: 1.91113 au
magnitude: 4.85770 debye
