program: Orca
programVersion: 5.0.2
elementType: F F O O O O N C C C C C C C C C C C C C C C C C C C C C C C C C C H H H H H H H H H H H H H H H H H H H H H H H
charge: 0
multiplicity: 1
keywords: wb97x-d3
keywords: def2-TZVPP
keywords: def2/J RIJCOSX
keywords: DEFGRID2
keywords: scfconv7
keywords: smallprint printgap noloewdin
keywords: NOSOSCF
formula: C26H23F2NO4
InChI: InChI=1/C26H23F2NO4/c1-17(2)24(18-11-13-21(14-12-18)32-26(27)28)25(30)33-23(16-29)19-7-6-10-22(15-19)31-20-8-4-3-5-9-20/h3-15,17,23-24,26H,1-2H3
56 atoms
F  -3.134232 -1.022085 1.423293
F  -3.502727 -3.150185 1.436391
O  3.110897 0.244334 0.859557
O  3.639754 0.029701 -1.300048
O  -2.592983 -2.224332 -0.387754
O  -1.637899 1.145694 -0.286628
N  3.193901 2.615683 3.146285
C  3.066209 -1.938947 -0.002714
C  3.852883 -2.864409 -0.941303
C  1.559391 -2.079494 -0.09696
C  5.353202 -2.71911 -0.706881
C  3.427932 -4.312424 -0.726211
C  3.337636 -0.473519 -0.252468
C  0.811989 -2.415225 1.022648
C  0.883103 -1.823854 -1.287666
C  3.076548 1.655244 0.719817
C  -0.574613 -2.489067 0.981968
C  -0.497827 -1.877987 -1.343811
C  -1.227894 -2.201021 -0.207185
C  1.81481 2.142757 0.039781
C  0.620351 1.458061 0.213158
C  1.861712 3.295822 -0.731835
C  -0.5256 1.916969 -0.422443
C  3.14657 2.176025 2.086709
C  0.701919 3.75696 -1.336001
C  -0.495153 3.071558 -1.195805
C  -3.471043 -2.060698 0.62934
C  -2.88555 1.707953 -0.322492
C  -3.227909 2.758448 0.518682
C  -3.819862 1.149107 -1.181029
C  -4.525139 3.248821 0.493812
C  -5.117174 1.642702 -1.188215
C  -5.474076 2.694308 -0.355505
H  3.359227 -2.167126 1.027043
H  3.631118 -2.589221 -1.977003
H  5.616381 -2.989728 0.318615
H  5.714138 -1.705402 -0.884994
H  5.911431 -3.379026 -1.372686
H  4.018466 -4.980351 -1.355153
H  3.578819 -4.619539 0.311793
H  2.378807 -4.47795 -0.972473
H  1.313743 -2.62502 1.959352
H  1.429546 -1.559144 -2.184671
H  3.957015 2.024203 0.183005
H  -1.099773 -2.774413 1.881557
H  -1.014286 -1.65835 -2.269834
H  0.560867 0.56511 0.82411
H  2.795811 3.826912 -0.865205
H  0.730986 4.653014 -1.941839
H  -1.385137 3.431334 -1.69617
H  -4.461558 -1.900415 0.206214
H  -2.496279 3.183872 1.194676
H  -3.536472 0.330147 -1.830504
H  -4.79576 4.065138 1.151069
H  -5.849017 1.203968 -1.854299
H  -6.485722 3.077973 -0.364812
elementType: F O N C H
totalener: -1560.11846438 hartree
nucrepener: 3460.32715019 hartree
electener: -5020.44561457 hartree
oneelecener: -9012.92072999 hartree
twoeener: 3992.47511542 hartree
cpcmener: -0.03603011 hartree
kineticenergy: 1553.64581118 hartree
xcener: -146.818773180114 hartree
chargesum: 0.0000000
charge: -0.208718 -0.216337 -0.276851 -0.415521 -0.313202 -0.303798 -0.084988 0.132047 0.066875 -0.066621 -0.292884 -0.312229 0.321995 -0.202750 -0.134849 0.374296 -0.143830 -0.223243 0.252099 0.067552 -0.284075 -0.211011 0.268803 -0.232485 -0.120121 -0.201417 0.438637 0.253537 -0.178702 -0.241677 -0.150476 -0.130397 -0.164918 0.095423 0.045036 0.088108 0.094687 0.093030 0.097612 0.089856 0.098355 0.136511 0.141455 0.146372 0.135681 0.146744 0.153907 0.142851 0.159627 0.155359 0.133564 0.158989 0.146847 0.158556 0.158426 0.158264
qa: -0.2087 -0.2163 -0.2769 -0.4155 -0.3132 -0.3038 -0.0850 0.1320 0.0669 -0.0666 -0.2929 -0.3122 0.3220 -0.2028 -0.1348 0.3743 -0.1438 -0.2232 0.2521 0.0676 -0.2841 -0.2110 0.2688 -0.2325 -0.1201 -0.2014 0.4386 0.2535 -0.1787 -0.2417 -0.1505 -0.1304 -0.1649 0.0954 0.0450 0.0881 0.0947 0.0930 0.0976 0.0899 0.0984 0.1365 0.1415 0.1464 0.1357 0.1467 0.1539 0.1429 0.1596 0.1554 0.1336 0.1590 0.1468 0.1586 0.1584 0.1583
va: 1.0686 1.0665 2.1392 2.0828 2.0977 2.0509 3.1141 3.6766 3.8046 3.4847 3.9269 3.9507 4.2439 4.0221 3.9092 3.7418 3.9571 3.9784 3.7298 3.5981 4.0536 3.9886 3.7674 4.0830 3.8983 3.9400 4.2207 3.6219 3.9476 3.9616 3.9046 3.8846 3.8921 1.0384 1.0269 1.0021 1.0130 1.0046 1.0048 1.0020 1.0004 1.0072 1.0154 1.0152 1.0290 1.0037 1.0077 1.0024 0.9902 0.9983 0.9770 0.9968 1.0126 0.9900 0.9901 0.9896
dispcorr: -0.035111440 hartree
energy: -1560.153575820311
dipole: 19.52435 -20.30656 -0.78221 -6.44315 6.18829 -0.25486 -12.63346 11.09984 -1.53362
magnitude: 1.74034 au
magnitude: 4.42360 debye
