program: Orca
programVersion: 5.0.2
elementType: F F O O O O N C C C C C C C C C C C C C C C C C C C C C C C C C C H H H H H H H H H H H H H H H H H H H H H H H
charge: 0
multiplicity: 1
keywords: wb97x-d3
keywords: def2-TZVPP
keywords: def2/J RIJCOSX
keywords: DEFGRID2
keywords: scfconv7
keywords: smallprint printgap noloewdin
keywords: NOSOSCF
formula: C26H23F2NO4
InChI: InChI=1/C26H23F2NO4/c1-17(2)24(18-11-13-21(14-12-18)32-26(27)28)25(30)33-23(16-29)19-7-6-10-22(15-19)31-20-8-4-3-5-9-20/h3-15,17,23-24,26H,1-2H3
56 atoms
F  -3.915149 -1.362524 2.950742
F  -3.844037 -2.708115 1.260083
O  3.088165 0.58486 -0.116729
O  2.302851 0.209277 -2.184363
O  -1.984255 -2.1091 2.323645
O  -2.265476 1.368146 0.199442
N  4.490957 3.387813 0.9444
C  2.783516 -1.65772 -0.721925
C  2.984605 -2.61983 -1.897097
C  1.493824 -1.839016 0.060669
C  4.326218 -2.361293 -2.575963
C  2.913105 -4.062758 -1.411752
C  2.717349 -0.207144 -1.137287
C  0.263423 -1.926302 -0.581015
C  1.512214 -1.825978 1.452462
C  2.593037 1.925206 -0.08979
C  -0.920265 -2.026858 0.137365
C  0.340877 -1.903276 2.185346
C  -0.87436 -2.004676 1.524064
C  1.319943 1.935966 0.721008
C  0.120542 1.737155 0.045364
C  1.34935 2.001346 2.107678
C  -1.055959 1.614358 0.77189
C  3.657323 2.736209 0.498919
C  0.164915 1.874779 2.818691
C  -1.037082 1.679889 2.160377
C  -3.190249 -1.685926 1.866335
C  -2.526219 1.702783 -1.104204
C  -2.268258 2.974202 -1.600339
C  -3.135263 0.739344 -1.894629
C  -2.618758 3.270353 -2.909698
C  -3.492134 1.054204 -3.198207
C  -3.231308 2.316625 -3.712248
H  3.620426 -1.783386 -0.027725
H  2.190111 -2.462714 -2.632855
H  4.472221 -3.048567 -3.410683
H  5.15376 -2.511965 -1.878268
H  4.409978 -1.349977 -2.976174
H  1.936787 -4.313303 -0.995325
H  3.101944 -4.753133 -2.235344
H  3.662748 -4.257723 -0.640682
H  0.206401 -1.926504 -1.662556
H  2.456689 -1.747304 1.976802
H  2.414565 2.30309 -1.100727
H  -1.851908 -2.131564 -0.40306
H  0.367891 -1.883869 3.267508
H  0.116146 1.672224 -1.035332
H  2.282102 2.147931 2.638096
H  0.177664 1.927235 3.899296
H  -1.961117 1.57724 2.716109
H  -3.144099 -0.837065 1.182422
H  -1.804467 3.729297 -0.977548
H  -3.338032 -0.244456 -1.489124
H  -2.417411 4.259537 -3.30032
H  -3.973321 0.30458 -3.813197
H  -3.507913 2.55841 -4.73004
elementType: F O N C H
totalener: -1560.11805028 hartree
nucrepener: 3494.15441538 hartree
electener: -5054.27246567 hartree
oneelecener: -9078.64932372 hartree
twoeener: 4024.37685806 hartree
cpcmener: -0.03517839 hartree
kineticenergy: 1553.63376350 hartree
xcener: -146.817283123612 hartree
chargesum: -0.0000000
charge: -0.205203 -0.212646 -0.272468 -0.414827 -0.281293 -0.320204 -0.085314 0.124227 0.061193 0.009544 -0.296205 -0.306493 0.323192 -0.216587 -0.180352 0.384211 -0.180875 -0.222908 0.268188 0.008493 -0.200735 -0.206428 0.316833 -0.226355 -0.112946 -0.255928 0.430033 0.317108 -0.213420 -0.253352 -0.133014 -0.127786 -0.181016 0.100119 0.044772 0.093562 0.089673 0.095346 0.098982 0.096015 0.089985 0.141474 0.136690 0.137031 0.149822 0.144539 0.144784 0.136107 0.157157 0.142577 0.086227 0.156446 0.146105 0.159506 0.158615 0.157801
qa: -0.2052 -0.2126 -0.2725 -0.4148 -0.2813 -0.3202 -0.0853 0.1242 0.0612 0.0095 -0.2962 -0.3065 0.3232 -0.2166 -0.1804 0.3842 -0.1809 -0.2229 0.2682 0.0085 -0.2007 -0.2064 0.3168 -0.2264 -0.1129 -0.2559 0.4300 0.3171 -0.2134 -0.2534 -0.1330 -0.1278 -0.1810 0.1001 0.0448 0.0936 0.0897 0.0953 0.0990 0.0960 0.0900 0.1415 0.1367 0.1370 0.1498 0.1445 0.1448 0.1361 0.1572 0.1426 0.0862 0.1564 0.1461 0.1595 0.1586 0.1578
va: 1.0719 1.0548 2.1286 2.0829 2.0565 2.0531 3.1101 3.6492 3.8144 3.4869 3.9282 3.9456 4.2683 3.9694 3.9684 3.7626 3.8571 3.9632 3.7420 3.6908 3.8762 3.9576 3.5902 4.0702 3.8864 3.9735 4.2336 3.6636 3.9536 3.9812 3.8884 3.9061 3.9129 1.0341 1.0269 1.0041 1.0023 1.0127 1.0014 1.0046 1.0021 1.0155 1.0068 1.0226 1.0069 1.0078 1.0209 1.0111 0.9901 1.0102 1.0033 0.9976 1.0063 0.9896 0.9905 0.9904
dispcorr: -0.036645251 hartree
energy: -1560.154695533400
dipole: 20.95484 -21.41539 -0.46055 -8.16651 7.73494 -0.43157 -20.48130 19.54340 -0.93790
magnitude: 1.13050 au
magnitude: 2.87349 debye
