program: Orca
programVersion: 5.0.2
elementType: F F O O O O N C C C C C C C C C C C C C C C C C C C C C C C C C C H H H H H H H H H H H H H H H H H H H H H H H
charge: 0
multiplicity: 1
keywords: wb97x-d3
keywords: def2-TZVPP
keywords: def2/J RIJCOSX
keywords: DEFGRID2
keywords: scfconv7
keywords: smallprint printgap noloewdin
keywords: NOSOSCF
formula: C26H23F2NO4
InChI: InChI=1/C26H23F2NO4/c1-17(2)24(18-11-13-21(14-12-18)32-26(27)28)25(30)33-23(16-29)19-7-6-10-22(15-19)31-20-8-4-3-5-9-20/h3-15,17,23-24,26H,1-2H3
56 atoms
F  -3.895694 -1.330967 0.519313
F  -2.979484 -0.22504 2.126815
O  3.096129 0.459207 -0.029789
O  1.863525 0.023128 -1.849232
O  -2.563088 -2.416423 1.956569
O  -2.063113 2.545782 0.184852
N  4.85089 3.121505 0.847816
C  2.55732 -1.801788 -0.434326
C  2.970541 -2.742328 -1.573984
C  1.19382 -2.044051 0.190449
C  4.335321 -2.333498 -2.120686
C  3.01251 -4.183738 -1.083871
C  2.474974 -0.360936 -0.888786
C  0.984455 -1.67945 1.518191
C  0.112942 -2.522275 -0.544694
C  2.773966 1.850706 -0.094167
C  -0.271068 -1.774618 2.098483
C  -1.143909 -2.643654 0.030116
C  -1.329303 -2.258138 1.347805
C  1.527775 2.092188 0.717949
C  0.327457 2.286214 0.051606
C  1.559641 1.991872 2.105141
C  -0.853551 2.348347 0.781228
C  3.940772 2.55207 0.44097
C  0.378439 2.096575 2.820711
C  -0.832767 2.261376 2.164908
C  -3.487547 -1.437358 1.806188
C  -2.38367 1.902773 -0.980076
C  -1.899644 0.641476 -1.304896
C  -3.276194 2.554823 -1.820283
C  -2.307162 0.04466 -2.489357
C  -3.684382 1.939008 -2.994218
C  -3.197309 0.685599 -3.339843
H  3.310951 -1.878412 0.354559
H  2.243466 -2.668096 -2.387791
H  4.333198 -1.331825 -2.554841
H  4.654161 -3.018947 -2.90734
H  5.096618 -2.354997 -1.337358
H  3.72216 -4.297876 -0.260781
H  2.042031 -4.536334 -0.734037
H  3.329968 -4.850816 -1.886765
H  1.81138 -1.309922 2.112513
H  0.235836 -2.814311 -1.579677
H  2.639981 2.182695 -1.12752
H  -0.416754 -1.491891 3.133068
H  -1.965071 -3.046498 -0.547942
H  0.316046 2.373929 -1.027674
H  2.494483 1.833897 2.629484
H  0.394299 2.029309 3.90037
H  -1.756263 2.330705 2.724923
H  -4.341556 -1.661891 2.442713
H  -1.216121 0.116711 -0.650098
H  -3.652006 3.534505 -1.552609
H  -1.924868 -0.936498 -2.7412
H  -4.38286 2.449604 -3.644654
H  -3.511067 0.211411 -4.260465
elementType: F O N C H
totalener: -1560.11623157 hartree
nucrepener: 3551.41031775 hartree
electener: -5111.52654932 hartree
oneelecener: -9194.91771278 hartree
twoeener: 4083.39116346 hartree
cpcmener: -0.03654524 hartree
kineticenergy: 1553.65132373 hartree
xcener: -146.817731593502 hartree
chargesum: 0.0000000
charge: -0.217005 -0.211075 -0.265816 -0.424661 -0.334353 -0.326930 -0.085289 0.136061 0.070433 0.096580 -0.300745 -0.302380 0.298643 -0.247557 -0.213531 0.395585 -0.187268 -0.224205 0.277201 0.028883 -0.187085 -0.230687 0.303309 -0.227443 -0.114890 -0.241533 0.418914 0.307672 -0.170709 -0.247919 -0.147630 -0.126934 -0.183469 0.092294 0.045214 0.096625 0.094121 0.093533 0.091131 0.100095 0.096257 0.144785 0.150836 0.135162 0.146702 0.147458 0.144806 0.141084 0.158915 0.142325 0.147581 0.105881 0.144087 0.153373 0.157035 0.156533
qa: -0.2170 -0.2111 -0.2658 -0.4247 -0.3344 -0.3269 -0.0853 0.1361 0.0704 0.0966 -0.3007 -0.3024 0.2986 -0.2476 -0.2135 0.3956 -0.1873 -0.2242 0.2772 0.0289 -0.1871 -0.2307 0.3033 -0.2274 -0.1149 -0.2415 0.4189 0.3077 -0.1707 -0.2479 -0.1476 -0.1269 -0.1835 0.0923 0.0452 0.0966 0.0941 0.0935 0.0911 0.1001 0.0963 0.1448 0.1508 0.1352 0.1467 0.1475 0.1448 0.1411 0.1589 0.1423 0.1476 0.1059 0.1441 0.1534 0.1570 0.1565
va: 1.0655 1.0731 2.1450 2.0720 2.0779 2.0877 3.1112 3.6888 3.7980 3.5137 3.9333 3.9442 4.2742 3.9617 3.9058 3.7590 3.9604 3.9807 3.6649 3.5834 3.9139 3.9526 3.6969 4.0739 3.8772 3.9879 4.2213 3.7125 3.8174 3.9948 3.8938 3.8963 3.9295 1.0363 1.0290 1.0100 1.0030 1.0032 1.0019 1.0019 1.0046 1.0066 0.9995 1.0205 1.0038 1.0061 1.0129 1.0100 0.9892 1.0126 0.9723 1.0208 1.0092 0.9941 0.9887 0.9910
dispcorr: -0.037733539 hartree
energy: -1560.153965106338
dipole: 19.11224 -19.89395 -0.78171 -16.40762 14.64299 -1.76463 -14.09965 14.33766 0.23801
magnitude: 1.94464 au
magnitude: 4.94289 debye
