program: Orca
programVersion: 5.0.2
elementType: F F O O O O N C C C C C C C C C C C C C C C C C C C C C C C C C C H H H H H H H H H H H H H H H H H H H H H H H
charge: 0
multiplicity: 1
keywords: wb97x-d3
keywords: def2-TZVPP
keywords: def2/J RIJCOSX
keywords: DEFGRID2
keywords: scfconv7
keywords: smallprint printgap noloewdin
keywords: NOSOSCF
formula: C26H23F2NO4
InChI: InChI=1/C26H23F2NO4/c1-17(2)24(18-11-13-21(14-12-18)32-26(27)28)25(30)33-23(16-29)19-7-6-10-22(15-19)31-20-8-4-3-5-9-20/h3-15,17,23-24,26H,1-2H3
56 atoms
F  -3.792202 -3.774542 0.478763
F  -4.887426 -2.133416 -0.400145
O  2.808844 0.446226 0.995126
O  3.722034 0.062505 -1.00303
O  -2.77162 -2.270748 -0.806676
O  -1.522532 1.946396 -1.27102
N  2.460797 2.999927 3.063479
C  2.782435 -1.7862 0.255936
C  3.621965 -2.788452 -0.554525
C  1.292032 -1.881377 -0.002903
C  5.076381 -2.759505 -0.094134
C  3.06485 -4.200811 -0.417611
C  3.188718 -0.355868 -0.011774
C  0.44246 -2.368164 0.979959
C  0.738142 -1.514074 -1.228708
C  2.940529 1.842424 0.771299
C  -0.920687 -2.518268 0.758829
C  -0.620718 -1.634305 -1.460381
C  -1.448722 -2.146607 -0.468772
C  1.965518 2.359169 -0.261977
C  0.654893 1.901084 -0.256222
C  2.386575 3.29381 -1.197506
C  -0.236915 2.40006 -1.194928
C  2.672784 2.469402 2.06718
C  1.483486 3.779949 -2.130472
C  0.168818 3.340592 -2.131472
C  -3.70999 -2.460457 0.156596
C  -2.324192 1.916723 -0.164414
C  -2.08908 2.674327 0.977488
C  -3.450077 1.10621 -0.253138
C  -2.980679 2.592877 2.0389
C  -4.337875 1.049052 0.810074
C  -4.104193 1.783126 1.96579
H  2.945645 -1.987353 1.319965
H  3.578676 -2.504976 -1.610728
H  5.681425 -3.447427 -0.686672
H  5.158793 -3.068273 0.950827
H  5.532901 -1.773133 -0.184282
H  2.060856 -4.295203 -0.831388
H  3.701859 -4.909701 -0.94911
H  3.02649 -4.515296 0.628218
H  0.847546 -2.661795 1.940568
H  1.365231 -1.124638 -2.021709
H  3.965846 2.103837 0.488212
H  -1.528699 -2.939467 1.548046
H  -1.040614 -1.341292 -2.414296
H  0.327317 1.166848 0.470838
H  3.41341 3.637088 -1.200082
H  1.804423 4.508114 -2.863912
H  -0.539267 3.718907 -2.857887
H  -3.552404 -1.878414 1.067578
H  -1.229478 3.327395 1.054986
H  -3.631303 0.538121 -1.15711
H  -2.790159 3.179616 2.928734
H  -5.216536 0.421741 0.734094
H  -4.793865 1.728503 2.797672
elementType: F O N C H
totalener: -1560.12059363 hartree
nucrepener: 3456.27920933 hartree
electener: -5016.39980296 hartree
oneelecener: -9003.52194996 hartree
twoeener: 3987.12214700 hartree
cpcmener: -0.03611214 hartree
kineticenergy: 1553.62603222 hartree
xcener: -146.815944390239 hartree
chargesum: -0.0000000
charge: -0.209296 -0.198047 -0.279040 -0.412577 -0.271236 -0.327767 -0.086873 0.124073 0.072098 -0.078076 -0.291779 -0.315931 0.319305 -0.183830 -0.127569 0.401763 -0.142096 -0.245254 0.265333 0.055643 -0.261101 -0.194455 0.281155 -0.229254 -0.111585 -0.231793 0.376592 0.337798 -0.217817 -0.266393 -0.147576 -0.131370 -0.192280 0.095832 0.043481 0.093381 0.087219 0.093819 0.097792 0.099745 0.089464 0.139157 0.143415 0.145146 0.139744 0.145871 0.157917 0.144466 0.158710 0.147678 0.126680 0.152983 0.142547 0.159000 0.157928 0.157261
qa: -0.2093 -0.1980 -0.2790 -0.4126 -0.2712 -0.3278 -0.0869 0.1241 0.0721 -0.0781 -0.2918 -0.3159 0.3193 -0.1838 -0.1276 0.4018 -0.1421 -0.2453 0.2653 0.0556 -0.2611 -0.1945 0.2812 -0.2293 -0.1116 -0.2318 0.3766 0.3378 -0.2178 -0.2664 -0.1476 -0.1314 -0.1923 0.0958 0.0435 0.0934 0.0872 0.0938 0.0978 0.0997 0.0895 0.1392 0.1434 0.1451 0.1397 0.1459 0.1579 0.1445 0.1587 0.1477 0.1267 0.1530 0.1425 0.1590 0.1579 0.1573
va: 1.0599 1.0724 2.1433 2.0852 2.0530 2.0579 3.1092 3.7229 3.7961 3.5145 3.9306 3.9562 4.2424 4.0128 3.8692 3.7341 3.9099 3.9720 3.7644 3.5539 3.9684 3.9792 3.6620 4.0837 3.8909 4.0485 4.2599 3.6816 3.9054 3.9273 3.9067 3.8385 3.9299 1.0357 1.0288 1.0048 1.0019 1.0134 0.9997 1.0049 1.0016 1.0055 1.0146 1.0140 1.0135 1.0081 0.9976 1.0019 0.9891 1.0044 0.9710 0.9999 1.0234 0.9901 0.9972 0.9907
dispcorr: -0.035355061 hartree
energy: -1560.155948688871
dipole: 26.00776 -25.09724 0.91052 -5.59926 5.34645 -0.25281 -0.77700 0.72137 -0.05564
magnitude: 0.94660 au
magnitude: 2.40607 debye
