program: Orca
programVersion: 5.0.2
elementType: F F O O O O N C C C C C C C C C C C C C C C C C C C C C C C C C C H H H H H H H H H H H H H H H H H H H H H H H
charge: 0
multiplicity: 1
keywords: wb97x-d3
keywords: def2-TZVPP
keywords: def2/J RIJCOSX
keywords: DEFGRID2
keywords: scfconv7
keywords: smallprint printgap noloewdin
keywords: NOSOSCF
formula: C26H23F2NO4
InChI: InChI=1/C26H23F2NO4/c1-17(2)24(18-11-13-21(14-12-18)32-26(27)28)25(30)33-23(16-29)19-7-6-10-22(15-19)31-20-8-4-3-5-9-20/h3-15,17,23-24,26H,1-2H3
56 atoms
F  -4.087457 -1.299535 1.307893
F  -3.615532 -2.808604 -0.163255
O  3.423066 0.425835 0.371574
O  3.269917 -0.14564 -1.790852
O  -2.118532 -2.19815 1.36146
O  -1.695851 1.478267 -1.232645
N  4.387534 3.332366 1.607483
C  3.35145 -1.870224 -0.092632
C  3.92808 -2.909559 -1.059318
C  1.889244 -2.055724 0.271785
C  5.413313 -2.651348 -1.290728
C  3.71746 -4.314891 -0.507493
C  3.37708 -0.460398 -0.63677
C  1.481442 -1.973521 1.599105
C  0.916086 -2.207309 -0.710123
C  2.931208 1.745155 0.132286
C  0.141014 -2.02484 1.939774
C  -0.431208 -2.278839 -0.386037
C  -0.813287 -2.164553 0.943669
C  1.468541 1.776108 0.499296
C  0.52266 1.709778 -0.514794
C  1.07121 1.75013 1.831265
C  -0.823516 1.602112 -0.191996
C  3.746131 2.62918 0.96501
C  -0.276257 1.646149 2.13757
C  -1.231007 1.558927 1.135305
C  -3.097821 -1.763369 0.527481
C  -2.933424 2.062961 -1.167226
C  -3.110333 3.360522 -0.701203
C  -4.008654 1.328548 -1.646178
C  -4.382541 3.913953 -0.71015
C  -5.273486 1.899673 -1.659812
C  -5.467787 3.189959 -1.186488
H  3.936064 -1.898038 0.832132
H  3.40902 -2.834597 -2.019594
H  5.972789 -2.721599 -0.35474
H  5.608134 -1.668058 -1.721534
H  5.829359 -3.390331 -1.977353
H  4.180548 -5.055542 -1.1614
H  4.166815 -4.423315 0.482873
H  2.661382 -4.573006 -0.422421
H  2.218713 -1.849466 2.382671
H  1.196792 -2.273498 -1.754087
H  3.079647 2.047057 -0.908837
H  -0.166379 -1.941021 2.974403
H  -1.152647 -2.425262 -1.179424
H  0.825962 1.732745 -1.554711
H  1.800581 1.801269 2.630474
H  -0.591293 1.614992 3.172151
H  -2.277481 1.456837 1.394494
H  -2.780785 -0.99013 -0.175873
H  -2.27029 3.940608 -0.339095
H  -3.854635 0.321536 -2.014664
H  -4.52194 4.923899 -0.345766
H  -6.110464 1.326443 -2.037255
H  -6.456316 3.630051 -1.191457
elementType: F O N C H
totalener: -1560.11845725 hartree
nucrepener: 3445.84696840 hartree
electener: -5005.96542566 hartree
oneelecener: -8982.06454870 hartree
twoeener: 3976.09912304 hartree
cpcmener: -0.03666824 hartree
kineticenergy: 1553.63396549 hartree
xcener: -146.815669849777 hartree
chargesum: -0.0000000
charge: -0.203241 -0.211974 -0.272435 -0.417208 -0.280754 -0.329163 -0.086939 0.132169 0.059400 0.012476 -0.294627 -0.307972 0.319041 -0.182205 -0.231406 0.386544 -0.219965 -0.145721 0.234175 0.043123 -0.255714 -0.192411 0.275566 -0.224957 -0.168419 -0.134883 0.453561 0.277847 -0.179559 -0.257167 -0.151953 -0.124458 -0.174597 0.097920 0.044830 0.089011 0.096198 0.093342 0.096561 0.090485 0.099114 0.138731 0.144291 0.134012 0.146360 0.147168 0.131473 0.140323 0.159468 0.151557 0.068147 0.155939 0.153621 0.159252 0.158105 0.157919
qa: -0.2032 -0.2120 -0.2724 -0.4172 -0.2808 -0.3292 -0.0869 0.1322 0.0594 0.0125 -0.2946 -0.3080 0.3190 -0.1822 -0.2314 0.3865 -0.2200 -0.1457 0.2342 0.0431 -0.2557 -0.1924 0.2756 -0.2250 -0.1684 -0.1349 0.4536 0.2778 -0.1796 -0.2572 -0.1520 -0.1245 -0.1746 0.0979 0.0448 0.0890 0.0962 0.0933 0.0966 0.0905 0.0991 0.1387 0.1443 0.1340 0.1464 0.1472 0.1315 0.1403 0.1595 0.1516 0.0681 0.1559 0.1536 0.1593 0.1581 0.1579
va: 1.0697 1.0590 2.1371 2.0804 2.0533 2.0330 3.1097 3.6439 3.8097 3.4821 3.9290 3.9463 4.2744 3.9636 3.9911 3.7554 3.9578 3.8487 3.7783 3.6047 4.0254 3.9282 3.6163 4.0760 3.9224 3.8333 4.2548 3.6946 3.9058 3.9742 3.8935 3.8976 3.9026 1.0358 1.0274 1.0022 1.0115 1.0044 1.0047 1.0021 1.0012 1.0058 1.0135 1.0229 1.0070 1.0109 1.0274 1.0093 0.9916 1.0043 0.9859 0.9973 1.0004 0.9905 0.9898 0.9903
dispcorr: -0.035689587 hartree
energy: -1560.154146839945
dipole: 20.94221 -21.62756 -0.68535 -8.18435 7.71088 -0.47347 -6.58241 6.36742 -0.21499
magnitude: 0.86029 au
magnitude: 2.18669 debye
