program: Orca
programVersion: 5.0.2
elementType: F F O O O O N C C C C C C C C C C C C C C C C C C C C C C C C C C H H H H H H H H H H H H H H H H H H H H H H H
charge: 0
multiplicity: 1
keywords: wb97x-d3
keywords: def2-TZVPP
keywords: def2/J RIJCOSX
keywords: DEFGRID2
keywords: scfconv7
keywords: smallprint printgap noloewdin
keywords: NOSOSCF
formula: C26H23F2NO4
InChI: InChI=1/C26H23F2NO4/c1-17(2)24(18-11-13-21(14-12-18)32-26(27)28)25(30)33-23(16-29)19-7-6-10-22(15-19)31-20-8-4-3-5-9-20/h3-15,17,23-24,26H,1-2H3
56 atoms
F  -4.562154 -2.591168 0.286842
F  -3.398988 -1.353839 1.630721
O  3.229271 0.301808 0.775998
O  3.708515 -0.07816 -1.372159
O  -2.519915 -2.170154 -0.244949
O  -1.623579 1.149785 -0.061448
N  3.34706 2.87919 2.835953
C  3.137665 -1.937724 0.075704
C  3.894615 -2.941452 -0.804468
C  1.62778 -2.057538 0.00563
C  5.400362 -2.804381 -0.605687
C  3.449948 -4.362128 -0.477588
C  3.423945 -0.499036 -0.283886
C  0.94735 -1.889625 -1.199332
C  0.883138 -2.279419 1.153857
C  3.161463 1.696341 0.514885
C  -0.432574 -1.942824 -1.249363
C  -0.505467 -2.328541 1.125812
C  -1.159843 -2.157771 -0.085012
C  1.866006 2.087628 -0.162348
C  0.675775 1.478826 0.214982
C  1.876885 3.067338 -1.144751
C  -0.504475 1.837929 -0.420147
C  3.272693 2.338855 1.825443
C  0.685254 3.430868 -1.755012
C  -0.508136 2.817656 -1.407263
C  -3.337319 -2.427749 0.807612
C  -2.847917 1.76604 -0.099177
C  -3.87777 1.122908 -0.768281
C  -3.0678 2.967864 0.561733
C  -5.146835 1.685273 -0.764104
C  -4.338383 3.523884 0.548818
C  -5.381874 2.886195 -0.10973
H  3.439707 -2.096434 1.11578
H  3.659425 -2.739088 -1.853844
H  5.936872 -3.515541 -1.235567
H  5.678297 -3.00968 0.430947
H  5.771854 -1.810216 -0.857202
H  3.617777 -4.597152 0.576529
H  2.392828 -4.524496 -0.689464
H  4.014419 -5.084601 -1.069025
H  1.492267 -1.706837 -2.117297
H  1.386651 -2.405309 2.104526
H  4.014541 2.031996 -0.084252
H  -0.951457 -1.806228 -2.189821
H  -1.031681 -2.483726 2.057886
H  0.650215 0.723451 0.991682
H  2.80693 3.538908 -1.43619
H  0.685319 4.18998 -2.526214
H  -1.42484 3.097209 -1.910695
H  -3.063823 -3.309469 1.392977
H  -3.691231 0.189711 -1.283611
H  -2.260833 3.462314 1.088582
H  -5.952657 1.180699 -1.281435
H  -4.512859 4.459371 1.064817
H  -6.371931 3.322624 -0.11048
elementType: F O N C H
totalener: -1560.12040277 hartree
nucrepener: 3445.24980327 hartree
electener: -5005.37020604 hartree
oneelecener: -8982.71109454 hartree
twoeener: 3977.34088850 hartree
cpcmener: -0.03826275 hartree
kineticenergy: 1553.64699277 hartree
xcener: -146.819095875278 hartree
chargesum: -0.0000000
charge: -0.204188 -0.212785 -0.277676 -0.416482 -0.292327 -0.310695 -0.085605 0.131073 0.065598 -0.065775 -0.292645 -0.312117 0.317349 -0.113479 -0.216257 0.383536 -0.258774 -0.148414 0.291458 0.072219 -0.284418 -0.199501 0.244497 -0.231566 -0.126578 -0.187520 0.401465 0.263500 -0.247725 -0.180878 -0.125117 -0.147940 -0.171286 0.095999 0.045029 0.093224 0.088326 0.094243 0.089496 0.097965 0.097794 0.142310 0.137599 0.144737 0.143534 0.135915 0.151992 0.143819 0.159680 0.157363 0.145940 0.144329 0.157304 0.156796 0.158296 0.157362
qa: -0.2042 -0.2128 -0.2777 -0.4165 -0.2923 -0.3107 -0.0856 0.1311 0.0656 -0.0658 -0.2926 -0.3121 0.3173 -0.1135 -0.2163 0.3835 -0.2588 -0.1484 0.2915 0.0722 -0.2844 -0.1995 0.2445 -0.2316 -0.1266 -0.1875 0.4015 0.2635 -0.2477 -0.1809 -0.1251 -0.1479 -0.1713 0.0960 0.0450 0.0932 0.0883 0.0942 0.0895 0.0980 0.0978 0.1423 0.1376 0.1447 0.1435 0.1359 0.1520 0.1438 0.1597 0.1574 0.1459 0.1443 0.1573 0.1568 0.1583 0.1574
va: 1.0793 1.0575 2.1409 2.0821 2.0835 2.0474 3.1133 3.6822 3.8069 3.5025 3.9272 3.9502 4.2584 3.8828 4.0277 3.7392 4.0027 3.9295 3.7095 3.5881 4.0521 3.9810 3.7535 4.0858 3.9076 3.9372 4.2229 3.6817 3.9672 3.9402 3.8907 3.8971 3.9011 1.0379 1.0269 1.0045 1.0021 1.0129 1.0021 1.0004 1.0048 1.0141 1.0064 1.0157 1.0067 1.0136 1.0090 1.0022 0.9904 0.9967 0.9717 1.0237 0.9966 0.9909 0.9901 0.9899
dispcorr: -0.034636651 hartree
energy: -1560.155039419245
dipole: 22.92855 -22.89599 0.03256 -8.46461 7.33059 -1.13402 -9.10170 8.26899 -0.83271
magnitude: 1.40729 au
magnitude: 3.57705 debye
