program: Orca
programVersion: 5.0.2
elementType: F F O O O O N C C C C C C C C C C C C C C C C C C C C C C C C C C H H H H H H H H H H H H H H H H H H H H H H H
charge: 0
multiplicity: 1
keywords: wb97x-d3
keywords: def2-TZVPP
keywords: def2/J RIJCOSX
keywords: DEFGRID2
keywords: scfconv7
keywords: smallprint printgap noloewdin
keywords: NOSOSCF
formula: C26H23F2NO4
InChI: InChI=1/C26H23F2NO4/c1-17(2)24(18-11-13-21(14-12-18)32-26(27)28)25(30)33-23(16-29)19-7-6-10-22(15-19)31-20-8-4-3-5-9-20/h3-15,17,23-24,26H,1-2H3
56 atoms
F  -3.709308 -3.910721 0.590153
F  -4.841335 -2.234835 -0.166525
O  2.710474 0.522205 0.969497
O  4.02629 0.047563 -0.767995
O  -2.734096 -2.321007 -0.629439
O  -1.59077 2.173619 -1.301555
N  2.349595 3.147075 2.954009
C  2.825553 -1.740404 0.362801
C  3.67045 -2.792328 -0.388674
C  1.334445 -1.858383 0.129616
C  3.485143 -4.161844 0.255877
C  3.399851 -2.882319 -1.885933
C  3.274757 -0.323561 0.091157
C  0.721158 -1.32468 -1.004202
C  0.537335 -2.542611 1.037506
C  2.878425 1.910804 0.715214
C  -0.637359 -1.472063 -1.220646
C  -0.82399 -2.7225 0.826962
C  -1.407755 -2.18176 -0.3088
C  1.945569 2.386509 -0.372771
C  0.598855 2.051527 -0.293879
C  2.433283 3.131968 -1.434608
C  -0.266785 2.493573 -1.282886
C  2.575696 2.581941 1.980233
C  1.556006 3.556824 -2.423217
C  0.208405 3.247462 -2.350282
C  -3.646415 -2.579105 0.342197
C  -2.315028 2.051421 -0.146702
C  -3.340455 1.115339 -0.156941
C  -2.101127 2.855438 0.967159
C  -4.15322 0.981317 0.959625
C  -2.909652 2.69463 2.083317
C  -3.935264 1.759226 2.088362
H  2.998251 -1.899345 1.433607
H  4.717361 -2.504392 -0.248361
H  3.72713 -4.145919 1.320361
H  4.138265 -4.897013 -0.217123
H  2.460257 -4.524586 0.151027
H  4.113053 -3.568614 -2.346498
H  2.401264 -3.271418 -2.09319
H  3.499483 -1.925221 -2.397056
H  1.299998 -0.779271 -1.739811
H  0.981094 -2.961462 1.93226
H  3.915823 2.149822 0.460656
H  -1.097976 -1.04521 -2.102666
H  -1.389404 -3.293345 1.551156
H  0.232301 1.454682 0.532489
H  3.48565 3.379313 -1.490667
H  1.924493 4.138242 -3.258091
H  -0.47689 3.582462 -3.118948
H  -3.468661 -2.049388 1.281208
H  -3.508624 0.511495 -1.039989
H  -1.317325 3.602548 0.976274
H  -4.9604 0.260688 0.94557
H  -2.735977 3.316095 2.952551
H  -4.564953 1.643678 2.960686
elementType: F O N C H
totalener: -1560.11846192 hartree
nucrepener: 3458.04760520 hartree
electener: -5018.16606712 hartree
oneelecener: -9006.93581238 hartree
twoeener: 3988.76974526 hartree
cpcmener: -0.03556180 hartree
kineticenergy: 1553.62580860 hartree
xcener: -146.816711950688 hartree
chargesum: -0.0000000
charge: -0.210193 -0.199576 -0.280985 -0.412440 -0.275604 -0.326491 -0.086823 0.123553 0.080714 0.048327 -0.327301 -0.316202 0.336251 -0.254204 -0.245996 0.414358 -0.190616 -0.122988 0.229303 0.056869 -0.271685 -0.199713 0.301085 -0.234695 -0.105962 -0.254237 0.379066 0.338974 -0.273282 -0.221934 -0.124427 -0.136055 -0.191979 0.099571 0.048718 0.097069 0.101218 0.089235 0.105304 0.084624 0.097366 0.146837 0.145632 0.141301 0.147547 0.142816 0.150380 0.145904 0.159251 0.147410 0.129236 0.142789 0.155235 0.160535 0.159390 0.157516
qa: -0.2102 -0.1996 -0.2810 -0.4124 -0.2756 -0.3265 -0.0868 0.1236 0.0807 0.0483 -0.3273 -0.3162 0.3363 -0.2542 -0.2460 0.4144 -0.1906 -0.1230 0.2293 0.0569 -0.2717 -0.1997 0.3011 -0.2347 -0.1060 -0.2542 0.3791 0.3390 -0.2733 -0.2219 -0.1244 -0.1361 -0.1920 0.0996 0.0487 0.0971 0.1012 0.0892 0.1053 0.0846 0.0974 0.1468 0.1456 0.1413 0.1475 0.1428 0.1504 0.1459 0.1593 0.1474 0.1292 0.1428 0.1552 0.1605 0.1594 0.1575
va: 1.0577 1.0701 2.1317 2.0847 2.0497 2.0704 3.1115 3.7327 3.8286 3.4681 3.9423 3.9349 4.2612 3.9242 4.0382 3.7401 3.9368 3.8854 3.8316 3.5603 3.9521 3.9771 3.6739 4.0877 3.8915 4.0436 4.2453 3.6588 3.9544 3.9207 3.8348 3.8949 3.9393 1.0324 1.0223 1.0021 1.0049 0.9997 1.0049 0.9973 1.0159 1.0011 1.0006 1.0180 1.0069 1.0134 1.0074 1.0030 0.9889 1.0059 0.9741 1.0214 0.9984 0.9962 0.9897 0.9913
dispcorr: -0.035645892 hartree
energy: -1560.154107811627
dipole: 23.48558 -22.69532 0.79026 -6.14296 5.75001 -0.39295 -3.78053 3.74360 -0.03694
magnitude: 0.88334 au
magnitude: 2.24527 debye
