program: Orca
programVersion: 5.0.2
elementType: F F O O O O N C C C C C C C C C C C C C C C C C C C C C C C C C C H H H H H H H H H H H H H H H H H H H H H H H
charge: 0
multiplicity: 1
keywords: wb97x-d3
keywords: def2-TZVPP
keywords: def2/J RIJCOSX
keywords: DEFGRID2
keywords: scfconv7
keywords: smallprint printgap noloewdin
keywords: NOSOSCF
formula: C26H23F2NO4
InChI: InChI=1/C26H23F2NO4/c1-17(2)24(18-11-13-21(14-12-18)32-26(27)28)25(30)33-23(16-29)19-7-6-10-22(15-19)31-20-8-4-3-5-9-20/h3-15,17,23-24,26H,1-2H3
56 atoms
F  -3.651725 -4.040393 0.132435
F  -4.845341 -2.327328 -0.424453
O  2.670975 0.508437 1.054472
O  4.018988 0.077518 -0.669757
O  -2.723961 -2.250559 -0.80958
O  -1.563998 2.276936 -1.261437
N  2.290956 3.056938 3.127728
C  2.799892 -1.737796 0.396732
C  3.673465 -2.773968 -0.343837
C  1.318618 -1.850032 0.104831
C  3.490481 -4.150801 0.285956
C  3.433194 -2.854303 -1.846473
C  3.251471 -0.314818 0.165509
C  0.744881 -1.268086 -1.025748
C  0.490663 -2.572213 0.953549
C  2.857572 1.90257 0.85393
C  -0.605399 -1.400765 -1.293282
C  -0.863248 -2.739675 0.689266
C  -1.40851 -2.145596 -0.439318
C  1.947386 2.434878 -0.22781
C  0.601061 2.088561 -0.208364
C  2.456339 3.258432 -1.219887
C  -0.24196 2.597036 -1.185488
C  2.537839 2.528297 2.138707
C  1.602139 3.749216 -2.19781
C  0.255285 3.429017 -2.182169
C  -3.652906 -2.685976 0.078649
C  -2.314778 2.063588 -0.137052
C  -2.138808 2.790802 1.034436
C  -3.32624 1.117823 -0.237509
C  -2.969314 2.540774 2.117344
C  -4.160479 0.892948 0.848091
C  -3.980014 1.593014 2.032831
H  2.931954 -1.916708 1.470056
H  4.713926 -2.475727 -0.17988
H  4.159663 -4.875333 -0.180857
H  2.471618 -4.522931 0.159013
H  3.712771 -4.140826 1.354704
H  2.443275 -3.253277 -2.075063
H  3.531001 -1.891752 -2.347315
H  4.162923 -3.528418 -2.298786
H  1.348657 -0.694168 -1.718157
H  0.902497 -3.029693 1.84467
H  3.901193 2.139893 0.623715
H  -1.034445 -0.934879 -2.171318
H  -1.450388 -3.340075 1.370946
H  0.217273 1.433229 0.563982
H  3.507748 3.515608 -1.230442
H  1.987566 4.391678 -2.978401
H  -0.41226 3.816083 -2.941905
H  -3.53838 -2.288164 1.08995
H  -1.36625 3.545017 1.114573
H  -3.466497 0.575966 -1.164263
H  -2.82467 3.10139 3.031824
H  -4.955663 0.163899 0.764949
H  -4.626609 1.407006 2.880196
elementType: F O N C H
totalener: -1560.11853829 hartree
nucrepener: 3454.94663707 hartree
electener: -5015.06517536 hartree
oneelecener: -9000.79625065 hartree
twoeener: 3985.73107528 hartree
cpcmener: -0.03583046 hartree
kineticenergy: 1553.63328592 hartree
xcener: -146.818465794101 hartree
chargesum: 0.0000000
charge: -0.209848 -0.199502 -0.280247 -0.412528 -0.273069 -0.326751 -0.086840 0.124088 0.081003 0.039132 -0.326968 -0.315724 0.335828 -0.242948 -0.248124 0.410041 -0.198680 -0.127652 0.244659 0.058340 -0.273840 -0.201211 0.304527 -0.232846 -0.106597 -0.253657 0.380600 0.335078 -0.218867 -0.274348 -0.137216 -0.118569 -0.191227 0.099353 0.048523 0.100870 0.088955 0.096943 0.084777 0.097155 0.105515 0.144271 0.146894 0.141908 0.147114 0.138988 0.150671 0.145569 0.159120 0.147405 0.127096 0.154871 0.142156 0.159336 0.158877 0.157600
qa: -0.2098 -0.1995 -0.2802 -0.4125 -0.2731 -0.3268 -0.0868 0.1241 0.0810 0.0391 -0.3270 -0.3157 0.3358 -0.2429 -0.2481 0.4100 -0.1987 -0.1277 0.2447 0.0583 -0.2738 -0.2012 0.3045 -0.2328 -0.1066 -0.2537 0.3806 0.3351 -0.2189 -0.2743 -0.1372 -0.1186 -0.1912 0.0994 0.0485 0.1009 0.0890 0.0969 0.0848 0.0972 0.1055 0.1443 0.1469 0.1419 0.1471 0.1390 0.1507 0.1456 0.1591 0.1474 0.1271 0.1549 0.1422 0.1593 0.1589 0.1576
va: 1.0591 1.0712 2.1310 2.0843 2.0543 2.0719 3.1111 3.7337 3.8260 3.4807 3.9423 3.9358 4.2600 3.9187 4.0380 3.7386 3.9353 3.8944 3.8186 3.5665 3.9530 3.9810 3.6756 4.0858 3.8916 4.0410 4.2470 3.6570 3.9188 3.9623 3.8948 3.8360 3.9375 1.0330 1.0224 1.0050 1.0000 1.0020 0.9971 1.0152 1.0049 1.0033 0.9996 1.0183 1.0071 1.0134 1.0061 1.0027 0.9890 1.0060 0.9743 0.9986 1.0203 0.9897 0.9977 0.9913
dispcorr: -0.035515690 hartree
energy: -1560.154053984067
dipole: 23.44008 -22.71087 0.72921 -5.94127 5.47913 -0.46214 -2.48480 2.53421 0.04941
magnitude: 0.86473 au
magnitude: 2.19796 debye
