program: Gaussian 09
title: 000072213
version: EM64L-G09RevD.01
frameworkgroup: C1[X(C11H14FN5O2)]
method: RPBEPBE
basis: SDD
operation: Freq
keyword: #p
keyword: freq=noraman
keyword: PBEPBE/SDD
title: #p freq=noraman PBEPBE/SDD
converged: YES YES NO NO
title: Mulliken charges:
elementType: F O O N N N N N C C C C C C C C C C C H H H H H H H H H H H H H H
charge: -0.221080 -0.289588 -0.437789 -0.171845 -0.090405 -0.057160 -0.062772 -0.360221 -0.074067 -0.055218 -0.510282 -0.062096 -0.329008 0.157725 -0.182418 -0.105567 0.184478 -0.373448 -0.601240 0.270771 0.250967 0.246094 0.260200 0.253347 0.212193 0.216492 0.282471 0.358148 0.242642 0.337861 0.210191 0.250690 0.249933
chargesum: 0.00000
title: Mulliken charges with hydrogens summed into heavy atoms:
elementType: F O O N N N N N C C C C C C C C C C C
charge: -0.221080 -0.289588 -0.079641 -0.171845 -0.090405 -0.057160 -0.062772 -0.022360 0.196704 0.195749 -0.003987 0.191250 0.099678 0.157725 0.100053 -0.105567 0.184478 -0.130806 0.109574
polarizability: 2.35238456e+02 5.54475191e+00 1.49751985e+02 4.93472468e+00 -1.29254583e+01 1.01103598e+02
1716.lowfreq: -27.7401 -8.6649 -4.3187 -0.0009 -0.0005 -0.0005 2.6553 22.1040 26.1279
frequency: -27.4276 21.7507 25.9427 53.5198 86.2264 109.3038 110.1578 116.6400 172.6465 182.6537 198.1917 221.3639 238.4605 277.2731 299.0379 354.4980 365.3915 372.0023 425.5494 463.2168 475.3280 497.3049 543.9991 566.1023 602.4620 641.3368 643.0751 665.8484 710.9828 712.7167 767.5821 773.8742 784.9639 790.0689 813.6112 821.7938 849.7950 862.5000 929.2390 932.3846 949.4416 969.2662 985.4474 1006.4535 1024.8450 1043.3225 1073.5782 1090.5210 1109.0036 1123.3559 1135.0886 1170.8504 1176.5025 1202.8054 1209.8602 1225.6041 1271.2543 1281.9783 1287.3451 1300.0644 1304.4761 1308.9144 1315.3466 1319.0954 1345.3232 1364.2056 1377.1610 1385.1389 1402.4665 1419.8706 1428.9720 1448.8994 1453.4097 1455.8876 1461.2586 1481.9260 1504.7830 1547.3354 1622.1680 2971.5178 2987.5605 2990.4236 3025.3409 3043.6661 3070.1582 3070.5474 3087.1275 3095.3741 3110.0073 3163.5225 3263.1394 3535.6097 3569.2261
redmass: 1.0213 6.0319 5.8212 4.8404 4.6504 4.7371 5.5356 3.7621 4.5413 4.0909 8.4826 4.8615 7.3495 5.1929 5.3623 4.6276 2.3196 4.2643 4.6812 3.3209 1.1513 7.9862 1.2455 2.9824 6.9192 7.1510 4.9090 8.3679 4.8528 5.4012 5.3718 3.6844 5.0820 4.7098 3.0189 1.8003 7.4479 3.4654 1.4355 3.2162 2.9617 2.9224 3.6484 2.8706 2.8140 2.2108 2.1275 4.1033 1.9582 1.2836 4.3613 1.1806 2.1121 1.5252 1.6185 1.7621 2.0529 2.1195 1.3192 1.3354 1.3107 3.7840 3.4399 1.7923 1.2322 3.2403 1.9481 1.3044 1.4718 2.2367 1.8346 1.1194 1.5088 1.0407 1.0902 1.6180 1.8532 6.7316 6.2753 1.0655 1.0846 1.0341 1.0642 1.0845 1.1012 1.0986 1.0905 1.1021 1.1013 1.0920 1.0991 1.0654 1.0780
irintensity: 0.0069 0.4700 0.9395 6.8016 7.6473 3.7583 0.9792 2.5148 1.0495 2.8533 0.6686 1.8363 0.3242 1.1585 0.2544 5.8029 1.8479 3.8349 9.5377 16.0422 124.5392 1.8176 98.0281 11.1745 7.2378 12.2484 23.1749 4.2744 9.0842 15.9270 10.3150 25.3741 18.0558 20.7093 15.0538 4.4627 4.8418 73.8178 10.3566 104.1318 7.6540 41.3902 44.7407 92.5114 112.1406 12.9709 2.9639 8.6688 25.3350 1.6281 18.2057 13.9920 5.1077 16.8506 45.2659 62.0501 41.4841 45.3724 4.1131 10.3128 13.1200 26.0209 49.0210 4.5077 45.1328 128.6817 2.6092 20.4663 8.4886 116.1565 6.6802 13.6394 40.5471 13.3519 8.0781 16.2594 18.6218 57.9061 631.6224 34.7627 7.6518 72.4074 10.2546 21.2268 27.8815 52.7168 17.5379 9.6780 22.5809 18.3345 1.7808 10.1514 70.4988
temp: 298.150 k
press: 1.00000 atm
elementType: 9 8 8 7 7 7 7 7 6 6 6 6 6 6 6 6 6 6 6 1 1 1 1 1 1 1 1 1 1 1 1 1 1
symmnumber: 1
zpe: 670179.4 jmol-1
zpe.correction: 0.255258 hartree
zpe.thermalcorrener: 0.271780 hartree
zpe.thermalcorrenthalpy: 0.272724 hartree
zpe.thermalcorrgfe: 0.209256 hartree
zpe.sumelectzpe: -950.191952 hartree
zpe.sumelectthermal: -950.175430 hartree
zpe.sumelectthermalent: -950.174486 hartree
zpe.sumelectthermalfe: -950.237954 hartree
dipole: 0.5937 1.9739 1.8959
dipole: 2.8005
quadrupole: -94.2624 -110.8700 -117.8225
quadrupole: 23.4342 5.2925 0.2508
quadrupole: 13.3893 -3.2184 -10.1709 23.4342 5.2925 0.2508
hfenergy: -950.44721 hartree
pointgroup: C01 [X(C11H14F1N5O2)]
dipole: 0.2113344 0.8415964 0.6789964 debye
polarizability: 234.8804819|7.8181173|147.4817058|5.870909|-16.7014949|103.7318512 unknown
InChI: InChI=1S/C11H14FN5O2/c1-13-9-8-10(15-4-14-9)17(5-16-8)11-7(12)2-6(3-18)19-11/h4-7,11,13,18H,2-3H2,1H3
charge 0 multiplicity 1
33 atoms
F  2.32678 0.143134 2.095271
O  2.361286 0.060059 -0.98522
O  4.242175 -2.030111 -1.235127
N  0.261862 0.086968 0.180572
N  -1.165239 -1.604622 0.782711
N  -1.392414 1.709503 -0.724987
N  -3.69646 0.854164 -0.582042
N  -4.215008 -1.278986 0.323217
C  1.465558 0.842766 -0.104407
C  2.329966 1.239233 1.114799
C  3.738596 1.376331 0.527369
C  3.792954 0.305147 -0.590777
C  4.381903 -1.047528 -0.161775
C  -1.03108 0.522664 -0.159271
C  0.115008 -1.200024 0.739006
C  -1.892099 -0.531483 0.226825
C  -3.287859 -0.330482 -0.007556
C  -2.746985 1.786178 -0.901522
C  -5.653358 -1.107243 0.092274
H  1.128232 1.758945 -0.630881
H  1.948075 2.125283 1.646587
H  3.859213 2.389577 0.104767
H  4.506473 1.232111 1.305538
H  4.304618 0.661614 -1.502005
H  3.890672 -1.389366 0.7732
H  5.467827 -0.954356 0.01494
H  0.966702 -1.776512 1.085472
H  3.290702 -2.021976 -1.519767
H  -3.122324 2.708184 -1.35564
H  -3.858926 -2.138618 0.743401
H  -6.180014 -2.01115 0.439159
H  -5.866255 -0.95075 -0.980193
H  -6.04028 -0.228452 0.638163
